{"text_format":"1","workbook":"xlsx","n_sheets":9,"sheets":["Instructions","Inputs","WWF Results","CWF Results","TSF Results","316a Results","ORSANCO","Reference","Versions"],"not_rendered":{"charts":0,"images":1,"macros":1,"external_links":1,"defined_names":83,"comments":0,"pivot_tables":0},"unopened":[],"bounds":{"document_bytes":16777216,"sheet_cells":100000,"rows_first":2000,"rows_last":500,"rows_between":2000,"halvings":0,"cell_chars":16384,"cell_head_chars":4096},"cells_cut":0,"cells_raw":0,"read":"whole","date_system":"1900"}

{"sheet":"Instructions","index":0,"n_rows":27,"n_cols":11,"rows_kept":27,"cut":false,"hidden":false,"merged":[[10,1,12,10]]}
[]
[null,null,null,null,null,null,null,null,null,null,"Thermal Limits Spreadsheet"]
[null,null,null,null,null,null,null,null,null,null,"Version 1.0, April 2024"]
[]
[]
[]
[]
[]
[]
[]
[null,"If prompted by Excel after opening the DEP Thermal Limits Spreadsheet, enable editing and macros.  This spreadsheet consists of three hyperlink tabs: Instructions, Inputs,  and Results.  Each tab has a corresponding worksheet."]
[]
[]
[]
[null,"Only those cells that are highlighted are available for data entry by the user:"]
[]
[null,"Red asterisks (*) are shown where cells may not be blank in order to calculate effluent limitations."]
[]
[null,"Purple asterisks (*) are shown where data may be left blank and still calculate effluent limitations."]
[]
{"$rows_left_out":8}
{"sheet":"Inputs","index":1,"n_rows":34,"n_cols":23,"rows_kept":34,"cut":false,"hidden":false,"merged":[[12,21,14,21],[12,22,14,22],[0,9,0,15],[1,9,1,15],[5,2,5,5],[7,2,7,5],[7,9,7,15],[9,9,9,15],[11,1,11,5],[11,13,11,15],[10,2,10,5],[5,9,5,13],[5,14,5,15],[12,2,14,2],[12,3,14,3],[12,4,14,4],[12,15,14,15],[12,5,14,5],[12,8,14,8],[12,9,14,9],[12,10,14,10],[12,11,14,11],[12,7,14,7]]}
[null,null,null,null,null,null,null,null,null,{"$f":"Instructions!K2","v":"Thermal Limits Spreadsheet"}]
[null,null,null,null,null,null,null,null,null,{"$f":"Instructions!K3","v":"Version 1.0, April 2024"}]
[]
[]
[]
[null,"Facility:",null,null,null,null,null,null,"Permit No.:"]
[]
[null,"Stream Name:",null,null,null,null,null,null,"Analyst/Engineer:"]
[null,null,null,null,null,null,null,null,null,null,null,null,null,null,null,null,null,null,"WWF"]
[null,"Stream Q7-10 (cfs)*:",null,null,"Outfall No.: ",null,null,null,"Analysis Type*:",null,null,null,null,null,null,null,null,null,"CWF"]
[null,null,null,null,null,null,null,null,null,null,null,null,null,null,null,null,null,null,"TSF"]
[null,"Facility Flows",null,null,null,null,null,null,"Stream Flows",null,null,null,null,"Temperature",null,null,null,null,"316a"]
[null,null,"Intake     (Stream)     (MGD)*","Intake         (External)     (MGD)*","Consumptive    Loss        (MGD)*","Discharge          Flow            (MGD)",null,"Q7-10 Multipliers (Default Shown)","PMF","Seasonal Stream Flow (cfs)","Adjusted Stream Flow     (cfs)","Downstream Stream Flow (cfs)",null,null,"316a","Ambient Stream Temperature (ºF)",null,null,"ORSANCO",null,null,"Q7-10 Multipliers (Default Shown)","PMF"]
[null,"Semi-Monthly",null,null,null,null,null,null,null,null,null,null,null,"Ambient Stream","Criteria*"]
[null,"Increment",null,null,null,null,null,null,null,null,null,null,null,"Temperature (ºF)*","(ºF)",null,null,"Hide: Adjusted Stream Flow"]
[null," Jan  1-31  ",null,null,null,{"$f":"MAX(0,D16+C16-E16)","v":0},null,3.2,1,{"$f":"RawQ*Inputs!H16","v":0},{"$f":"MAX(0,(J16-C16*1.547)*I16)","v":0},{"$f":"MAX(0,MIN(J16+D16*1.547-E16*1.547,MAX(0,K16+F16*1.547)))","v":0},null,null,null,null,null,"Rename Upstream to Seasonal",null,null,null,3.2,1]
[null," Feb  1-29   ",null,null,null,{"$f":"MAX(0,D17+C17-E17)","v":0},null,3.5,1,{"$f":"RawQ*Inputs!H17","v":0},{"$f":"MAX(0,(J17-C17*1.547)*I17)","v":0},{"$f":"MAX(0,MIN(J17+D17*1.547-E17*1.547,MAX(0,K17+F17*1.547)))","v":0},null,null,null,null,null,null,null,null,null,3.5,1]
[null," Mar  1-31  ",null,null,null,0,null,7,1,{"$f":"RawQ*Inputs!H18","v":0},0,0,null,null,null,null,null,null,null,null,null,7,1]
[null," Apr  1-15",null,null,null,0,null,9.3000000000000007,1,{"$f":"RawQ*Inputs!H19","v":0},{"$f":"MAX(0,(J19-C19*1.547)*I19)","v":0},0,null,null,null,null,null,null,null,null,null,9.3000000000000007,1]
[null," Apr 16-30     ",null,null,null,0,null,9.3000000000000007,1,{"$f":"RawQ*Inputs!H20","v":0},0,0,null,null,null,null,null,null,null,null,null,9.3000000000000007,1]
{"$rows_left_out":15}
{"sheet":"WWF Results","index":2,"n_rows":34,"n_cols":11,"rows_kept":34,"cut":false,"hidden":true,"merged":[]}
[]
[null,null,null,null,null,{"$f":"Instructions!K2","v":"Thermal Limits Spreadsheet"}]
[null,null,null,null,null,{"$f":"Instructions!K3","v":"Version 1.0, April 2024"}]
[]
[]
[]
[]
[]
[]
[null,"Recommended Limits for Case 1 or Case 2"]
[]
[null,null,"WWF","WWF","Case 1","Case 2",null,null,"PMF",null,"Hide: Discharge, PMF"]
[null,"Semi-Monthly","Ambient Stream","Target Maximum","Daily","Daily",null,null,null,null,"Hide: Default Data"]
[null,"Increment","Temperature (ºF)","Stream Temp.","WLA","WLA",null,"at Discharge"]
[null,null,"(Default)","(ºF)","(Million BTUs/day)","(ºF) ",null,"Flow (MGD)"]
[null," Jan  1-31  ",35,{"$f":"IF(Inputs!N16>0,MAX(Reference!C11,Inputs!N16+1),MAX(Reference!C11,C16+1))","v":40},{"$f":"IF(Inputs!D16<>0,\"N/A -- Case 2\",IF(Inputs!N16>0,MAX(D16-Inputs!N16,1),MAX(D16-C16,1))*Inputs!L16*5.39)","v":0},{"$f":"IF(Inputs!J16>(Inputs!C16*1.547),IF(Inputs!F16=0,\"0\", MIN(110,(((Inputs!L16*D16)-(Inputs!K16*(IF(Inputs!N16>0,Inputs!N16,C16))))/(Inputs!F16*1.547)))),IF(Inputs!J16<(Inputs!C16*1.547), \"Targ: \"& D16,0))","v":0},null,{"$f":"Inputs!F16","v":0},{"$f":"Inputs!I16","v":1}]
[null," Feb  1-29   ",35,{"$f":"IF(Inputs!N17>0,MAX(Reference!C12,Inputs!N17+1),MAX(Reference!C12,C17+1))","v":40},{"$f":"IF(Inputs!D17<>0,\"N/A -- Case 2\",IF(Inputs!N17>0,MAX(D17-Inputs!N17,1),MAX(D17-C17,1))*Inputs!L17*5.39)","v":0},{"$f":"IF(Inputs!J17>(Inputs!C17*1.547),IF(Inputs!F17=0,\"0\", MIN(110,(((Inputs!L17*D17)-(Inputs!K17*(IF(Inputs!N17>0,Inputs!N17,C17))))/(Inputs!F17*1.547)))),IF(Inputs!J17<(Inputs!C17*1.547), \"Targ: \"& D17,0))","v":0},null,{"$f":"Inputs!F17","v":0},{"$f":"Inputs!I17","v":1}]
[null," Mar  1-31  ",40,{"$f":"IF(Inputs!N18>0,MAX(Reference!C13,Inputs!N18+1),MAX(Reference!C13,C18+1))","v":46},{"$f":"IF(Inputs!D18<>0,\"N/A -- Case 2\",IF(Inputs!N18>0,MAX(D18-Inputs!N18,1),MAX(D18-C18,1))*Inputs!L18*5.39)","v":0},{"$f":"IF(Inputs!J18>(Inputs!C18*1.547),IF(Inputs!F18=0,\"0\", MIN(110,(((Inputs!L18*D18)-(Inputs!K18*(IF(Inputs!N18>0,Inputs!N18,C18))))/(Inputs!F18*1.547)))),IF(Inputs!J18<(Inputs!C18*1.547), \"Targ: \"& D18,0))","v":0},null,{"$f":"Inputs!F18","v":0},{"$f":"Inputs!I18","v":1}]
[null," Apr  1-15",47,{"$f":"IF(Inputs!N19>0,MAX(Reference!C14,Inputs!N19+1),MAX(Reference!C14,C19+1))","v":52},{"$f":"IF(Inputs!D19<>0,\"N/A -- Case 2\",IF(Inputs!N19>0,MAX(D19-Inputs!N19,1),MAX(D19-C19,1))*Inputs!L19*5.39)","v":0},{"$f":"IF(Inputs!J19>(Inputs!C19*1.547),IF(Inputs!F19=0,\"0\", MIN(110,(((Inputs!L19*D19)-(Inputs!K19*(IF(Inputs!N19>0,Inputs!N19,C19))))/(Inputs!F19*1.547)))),IF(Inputs!J19<(Inputs!C19*1.547), \"Targ: \"& D19,0))","v":0},null,{"$f":"Inputs!F19","v":0},{"$f":"Inputs!I19","v":1}]
[null," Apr 16-30     ",53,{"$f":"IF(Inputs!N20>0,MAX(Reference!C15,Inputs!N20+1),MAX(Reference!C15,C20+1))","v":58},{"$f":"IF(Inputs!D20<>0,\"N/A -- Case 2\",IF(Inputs!N20>0,MAX(D20-Inputs!N20,1),MAX(D20-C20,1))*Inputs!L20*5.39)","v":0},{"$f":"IF(Inputs!J20>(Inputs!C20*1.547),IF(Inputs!F20=0,\"0\", MIN(110,(((Inputs!L20*D20)-(Inputs!K20*(IF(Inputs!N20>0,Inputs!N20,C20))))/(Inputs!F20*1.547)))),IF(Inputs!J20<(Inputs!C20*1.547), \"Targ: \"& D20,0))","v":0},null,{"$f":"Inputs!F20","v":0},{"$f":"Inputs!I20","v":1}]
{"$rows_left_out":15}
{"sheet":"CWF Results","index":3,"n_rows":34,"n_cols":9,"rows_kept":34,"cut":false,"hidden":true,"merged":[]}
[]
[null,null,null,null,null,{"$f":"Instructions!K2","v":"Thermal Limits Spreadsheet"}]
[null,null,null,null,null,{"$f":"Instructions!K3","v":"Version 1.0, April 2024"}]
[]
[]
[]
[]
[]
[]
[null,"Recommended Limits for Case 1 or Case 2"]
[]
[null,null,"CWF","CWF","Case 1","Case 2",null,"PMF"]
[null,"Semi-Monthly","Ambient Stream","Target Maximum","Daily","Daily",null,null,"Hide: Discharge, PMF"]
[null,"Increment","Temperature (ºF)","Stream Temp.","WLA","WLA","at Discharge",null,"Hide: Default Data"]
[null,null,"(Default)","(ºF)","(Million BTUs/day)","(ºF) ","Flow (MGD)"]
[null," Jan  1-31  ",34,{"$f":"IF(Inputs!N16>0,MAX(Reference!D11,Inputs!N16+1),MAX(Reference!D11,C16+1))","v":38},{"$f":"IF(Inputs!D16<>0,\"N/A -- Case 2\",IF(Inputs!N16>0,MAX(D16-Inputs!N16,1),MAX(D16-C16,1))*Inputs!L16*5.39)","v":0},{"$f":"IF(Inputs!J16>(Inputs!C16*1.547),IF(Inputs!F16=0,\"0\", MIN(110,(((Inputs!L16*D16)-(Inputs!K16*(IF(Inputs!N16>0,Inputs!N16,C16))))/(Inputs!F16*1.547)))),IF(Inputs!J16<(Inputs!C16*1.547), \"Targ: \"& D16,0))","v":0},{"$f":"Inputs!F16","v":0},{"$f":"Inputs!I16","v":1}]
[null," Feb  1-29   ",35,{"$f":"IF(Inputs!N17>0,MAX(Reference!D12,Inputs!N17+1),MAX(Reference!D12,C17+1))","v":38},{"$f":"IF(Inputs!D17<>0,\"N/A -- Case 2\",IF(Inputs!N17>0,MAX(D17-Inputs!N17,1),MAX(D17-C17,1))*Inputs!L17*5.39)","v":0},{"$f":"IF(Inputs!J17>(Inputs!C17*1.547),IF(Inputs!F17=0,\"0\", MIN(110,(((Inputs!L17*D17)-(Inputs!K17*(IF(Inputs!N17>0,Inputs!N17,C17))))/(Inputs!F17*1.547)))),IF(Inputs!J17<(Inputs!C17*1.547), \"Targ: \"& D17,0))","v":0},{"$f":"Inputs!F17","v":0},{"$f":"Inputs!I17","v":1}]
[null," Mar  1-31  ",39,{"$f":"IF(Inputs!N18>0,MAX(Reference!D13,Inputs!N18+1),MAX(Reference!D13,C18+1))","v":42},{"$f":"IF(Inputs!D18<>0,\"N/A -- Case 2\",IF(Inputs!N18>0,MAX(D18-Inputs!N18,1),MAX(D18-C18,1))*Inputs!L18*5.39)","v":0},{"$f":"IF(Inputs!J18>(Inputs!C18*1.547),IF(Inputs!F18=0,\"0\", MIN(110,(((Inputs!L18*D18)-(Inputs!K18*(IF(Inputs!N18>0,Inputs!N18,C18))))/(Inputs!F18*1.547)))),IF(Inputs!J18<(Inputs!C18*1.547), \"Targ: \"& D18,0))","v":0},{"$f":"Inputs!F18","v":0},{"$f":"Inputs!I18","v":1}]
[null," Apr  1-15",46,{"$f":"IF(Inputs!N19>0,MAX(Reference!D14,Inputs!N19+1),MAX(Reference!D14,C19+1))","v":48},{"$f":"IF(Inputs!D19<>0,\"N/A -- Case 2\",IF(Inputs!N19>0,MAX(D19-Inputs!N19,1),MAX(D19-C19,1))*Inputs!L19*5.39)","v":0},{"$f":"IF(Inputs!J19>(Inputs!C19*1.547),IF(Inputs!F19=0,\"0\", MIN(110,(((Inputs!L19*D19)-(Inputs!K19*(IF(Inputs!N19>0,Inputs!N19,C19))))/(Inputs!F19*1.547)))),IF(Inputs!J19<(Inputs!C19*1.547), \"Targ: \"& D19,0))","v":0},{"$f":"Inputs!F19","v":0},{"$f":"Inputs!I19","v":1}]
[null," Apr 16-30     ",52,{"$f":"IF(Inputs!N20>0,MAX(Reference!D15,Inputs!N20+1),MAX(Reference!D15,C20+1))","v":53},{"$f":"IF(Inputs!D20<>0,\"N/A -- Case 2\",IF(Inputs!N20>0,MAX(D20-Inputs!N20,1),MAX(D20-C20,1))*Inputs!L20*5.39)","v":0},{"$f":"IF(Inputs!J20>(Inputs!C20*1.547),IF(Inputs!F20=0,\"0\", MIN(110,(((Inputs!L20*D20)-(Inputs!K20*(IF(Inputs!N20>0,Inputs!N20,C20))))/(Inputs!F20*1.547)))),IF(Inputs!J20<(Inputs!C20*1.547), \"Targ: \"& D20,0))","v":0},{"$f":"Inputs!F20","v":0},{"$f":"Inputs!I20","v":1}]
{"$rows_left_out":15}
{"sheet":"TSF Results","index":4,"n_rows":34,"n_cols":10,"rows_kept":34,"cut":false,"hidden":true,"merged":[]}
[]
[null,null,null,null,null,{"$f":"Instructions!K2","v":"Thermal Limits Spreadsheet"}]
[null,null,null,null,null,{"$f":"Instructions!K3","v":"Version 1.0, April 2024"}]
[]
[]
[]
[]
[]
[]
[null,"Recommended Limits for Case 1 or Case 2"]
[]
[null,null,"TSF","TSF","Case 1","Case 2",null,"PMF",null,"Hide: Discharge, PMF"]
[null,"Semi-Monthly","Ambient Stream","Target Maximum","Daily","Daily"]
[null,"Increment","Temperature (ºF)","Stream Temp.","WLA","WLA","at Discharge",null,null,"Hide: Default Data"]
[null,null,"(Default)","(ºF)","(Million BTUs/day)","(ºF) ","Flow (MGD)"]
[null," Jan  1-31  ",34,{"$f":"IF(Inputs!N16>0,MAX(Reference!E11,Inputs!N16+1),MAX(Reference!E11,C16+1))","v":40},{"$f":"IF(Inputs!D16<>0,\"N/A -- Case 2\",IF(Inputs!N16>0,MAX(D16-Inputs!N16,1),MAX(D16-C16,1))*Inputs!L16*5.39)","v":0},{"$f":"IF(Inputs!J16>(Inputs!C16*1.547),IF(Inputs!F16=0,\"0\", MIN(110,(((Inputs!L16*D16)-(Inputs!K16*(IF(Inputs!N16>0,Inputs!N16,C16))))/(Inputs!F16*1.547)))),IF(Inputs!J16<(Inputs!C16*1.547), \"Targ: \"& D16,0))","v":0},{"$f":"IF(F16>0,Inputs!F16,\"0\")","v":"0"},{"$f":"Inputs!I16","v":1}]
[null," Feb  1-29   ",35,{"$f":"IF(Inputs!N17>0,MAX(Reference!E12,Inputs!N17+1),MAX(Reference!E12,C17+1))","v":40},{"$f":"IF(Inputs!D17<>0,\"N/A -- Case 2\",IF(Inputs!N17>0,MAX(D17-Inputs!N17,1),MAX(D17-C17,1))*Inputs!L17*5.39)","v":0},{"$f":"IF(Inputs!J17>(Inputs!C17*1.547),IF(Inputs!F17=0,\"0\", MIN(110,(((Inputs!L17*D17)-(Inputs!K17*(IF(Inputs!N17>0,Inputs!N17,C17))))/(Inputs!F17*1.547)))),IF(Inputs!J17<(Inputs!C17*1.547), \"Targ: \"& D17,0))","v":0},{"$f":"IF(F17>0,Inputs!F17,\"0\")","v":"0"},{"$f":"Inputs!I17","v":1}]
[null," Mar  1-31  ",39,{"$f":"IF(Inputs!N18>0,MAX(Reference!E13,Inputs!N18+1),MAX(Reference!E13,C18+1))","v":46},{"$f":"IF(Inputs!D18<>0,\"N/A -- Case 2\",IF(Inputs!N18>0,MAX(D18-Inputs!N18,1),MAX(D18-C18,1))*Inputs!L18*5.39)","v":0},{"$f":"IF(Inputs!J18>(Inputs!C18*1.547),IF(Inputs!F18=0,\"0\", MIN(110,(((Inputs!L18*D18)-(Inputs!K18*(IF(Inputs!N18>0,Inputs!N18,C18))))/(Inputs!F18*1.547)))),IF(Inputs!J18<(Inputs!C18*1.547), \"Targ: \"& D18,0))","v":0},{"$f":"IF(F18>0,Inputs!F18,\"0\")","v":"0"},{"$f":"Inputs!I18","v":1}]
[null," Apr  1-15",46,{"$f":"IF(Inputs!N19>0,MAX(Reference!E14,Inputs!N19+1),MAX(Reference!E14,C19+1))","v":52},{"$f":"IF(Inputs!D19<>0,\"N/A -- Case 2\",IF(Inputs!N19>0,MAX(D19-Inputs!N19,1),MAX(D19-C19,1))*Inputs!L19*5.39)","v":0},{"$f":"IF(Inputs!J19>(Inputs!C19*1.547),IF(Inputs!F19=0,\"0\", MIN(110,(((Inputs!L19*D19)-(Inputs!K19*(IF(Inputs!N19>0,Inputs!N19,C19))))/(Inputs!F19*1.547)))),IF(Inputs!J19<(Inputs!C19*1.547), \"Targ: \"& D19,0))","v":0},{"$f":"IF(F19>0,Inputs!F19,\"0\")","v":"0"},{"$f":"Inputs!I19","v":1}]
[null," Apr 16-30     ",52,{"$f":"IF(Inputs!N20>0,MAX(Reference!E15,Inputs!N20+1),MAX(Reference!E15,C20+1))","v":58},{"$f":"IF(Inputs!D20<>0,\"N/A -- Case 2\",IF(Inputs!N20>0,MAX(D20-Inputs!N20,1),MAX(D20-C20,1))*Inputs!L20*5.39)","v":0},{"$f":"IF(Inputs!J20>(Inputs!C20*1.547),IF(Inputs!F20=0,\"0\", MIN(110,(((Inputs!L20*D20)-(Inputs!K20*(IF(Inputs!N20>0,Inputs!N20,C20))))/(Inputs!F20*1.547)))),IF(Inputs!J20<(Inputs!C20*1.547), \"Targ: \"& D20,0))","v":0},{"$f":"IF(F20>0,Inputs!F20,\"0\")","v":"0"},{"$f":"Inputs!I20","v":1}]
{"$rows_left_out":15}
{"sheet":"316a Results","index":5,"n_rows":34,"n_cols":10,"rows_kept":34,"cut":false,"hidden":true,"merged":[]}
[]
[null,null,null,null,{"$f":"Instructions!K2","v":"Thermal Limits Spreadsheet"}]
[null,null,null,null,{"$f":"Instructions!K3","v":"Version 1.0, April 2024"}]
[]
[]
[]
[]
[]
[]
[null,"Recommended Limits for Case 1 or Case 2"]
[]
[null,null,"316a","Case 1","Case 2",null,null,"PMF"]
[null,"Semi-Monthly","Target Maximum","Daily","Daily",null,null,null,null,"Hide: Discharge, PMF"]
[null,"Increment","Stream Temp.","WLA","WLA",null,"at Discharge",null,null,"Hide: Default Data"]
[null,null,"(ºF)","(Million BTUs/day)","(ºF) ",null,"Flow (MGD)"]
[null," Jan  1-31  ",{"$f":"IF(Inputs!P16>0,MAX(Inputs!O16,Inputs!P16+1),0)","v":0},{"$f":"IF(Inputs!D16<>0,\"N/A -- Case 2\",IF(Inputs!P16>0,MAX(C16-Inputs!P16,1),0)*Inputs!L16*5.39)","v":0},{"$f":"IF(Inputs!J16>(Inputs!C16*1.547),IF(Inputs!F16=0,\"0\", MIN(110,(((Inputs!L16*C16)-(Inputs!K16*(Inputs!P16)))/(Inputs!F16*1.547)))),IF(Inputs!J16<(Inputs!C16*1.547), \"Targ: \"& C16,0))","v":0},null,{"$f":"IF(E16>0,Inputs!F16,0)","v":0},{"$f":"Inputs!I16","v":1}]
[null," Feb  1-29   ",{"$f":"IF(Inputs!P17>0,MAX(Inputs!O17,Inputs!P17+1),0)","v":0},{"$f":"IF(Inputs!D17<>0,\"N/A -- Case 2\",IF(Inputs!P17>0,MAX(C17-Inputs!P17,1),0)*Inputs!L17*5.39)","v":0},{"$f":"IF(Inputs!J17>(Inputs!C17*1.547),IF(Inputs!F17=0,\"0\", MIN(110,(((Inputs!L17*C17)-(Inputs!K17*(Inputs!P17)))/(Inputs!F17*1.547)))),IF(Inputs!J17<(Inputs!C17*1.547), \"Targ: \"& C17,0))","v":0},null,{"$f":"IF(E17>0,Inputs!F17,0)","v":0},{"$f":"Inputs!I17","v":1}]
[null," Mar  1-31  ",{"$f":"IF(Inputs!P18>0,MAX(Inputs!O18,Inputs!P18+1),0)","v":0},{"$f":"IF(Inputs!D18<>0,\"N/A -- Case 2\",IF(Inputs!P18>0,MAX(C18-Inputs!P18,1),0)*Inputs!L18*5.39)","v":0},{"$f":"IF(Inputs!J18>(Inputs!C18*1.547),IF(Inputs!F18=0,\"0\", MIN(110,(((Inputs!L18*C18)-(Inputs!K18*(Inputs!P18)))/(Inputs!F18*1.547)))),IF(Inputs!J18<(Inputs!C18*1.547), \"Targ: \"& C18,0))","v":0},null,{"$f":"IF(E18>0,Inputs!F18,0)","v":0},{"$f":"Inputs!I18","v":1}]
[null," Apr  1-15",{"$f":"IF(Inputs!P19>0,MAX(Inputs!O19,Inputs!P19+1),0)","v":0},{"$f":"IF(Inputs!D19<>0,\"N/A -- Case 2\",IF(Inputs!P19>0,MAX(C19-Inputs!P19,1),0)*Inputs!L19*5.39)","v":0},{"$f":"IF(Inputs!J19>(Inputs!C19*1.547),IF(Inputs!F19=0,\"0\", MIN(110,(((Inputs!L19*C19)-(Inputs!K19*(Inputs!P19)))/(Inputs!F19*1.547)))),IF(Inputs!J19<(Inputs!C19*1.547), \"Targ: \"& C19,0))","v":0},null,{"$f":"IF(E19>0,Inputs!F19,0)","v":0},{"$f":"Inputs!I19","v":1}]
[null," Apr 16-30     ",{"$f":"IF(Inputs!P20>0,MAX(Inputs!O20,Inputs!P20+1),0)","v":0},{"$f":"IF(Inputs!D20<>0,\"N/A -- Case 2\",IF(Inputs!P20>0,MAX(C20-Inputs!P20,1),0)*Inputs!L20*5.39)","v":0},{"$f":"IF(Inputs!J20>(Inputs!C20*1.547),IF(Inputs!F20=0,\"0\", MIN(110,(((Inputs!L20*C20)-(Inputs!K20*(Inputs!P20)))/(Inputs!F20*1.547)))),IF(Inputs!J20<(Inputs!C20*1.547), \"Targ: \"& C20,0))","v":0},null,{"$f":"IF(E20>0,Inputs!F20,0)","v":0},{"$f":"Inputs!I20","v":1}]
{"$rows_left_out":15}
{"sheet":"ORSANCO","index":6,"n_rows":34,"n_cols":12,"rows_kept":34,"cut":false,"hidden":true,"merged":[]}
[]
[null,null,null,null,null,{"$f":"Instructions!K2","v":"Thermal Limits Spreadsheet"}]
[null,null,null,null,null,{"$f":"Instructions!K3","v":"Version 1.0, April 2024"}]
[]
[]
[]
[]
[]
[]
[null,"Recommended Limits for Case 1 or Case 2",null,null,null,null,null,null,null,null,null,"Reference"]
[]
[null,null,"ORSANCO","ORSANCO","Case 1","Case 2",null,null,"PMF",null,null,"ORSANCO"]
[null,"Semi-Monthly","Ambient Stream","Target Maximum","Daily","Daily",null,null,null,null,"Semi-Monthly","Criteria MP 0- 341"]
[null,"Increment","Temperature (ºF)","Stream Temp.","WLA","WLA",null,"at Discharge",null,null,"Increment","Stream Temp."]
[null,null,"(Default)","(ºF)","(Million BTUs/day)","(ºF) ",null,"Flow (MGD)",null,null,null,"(ºF)"]
[null," Jan  1-31  ",35,{"$f":"MIN(L16,(IF(Inputs!N16>0,MAX(Reference!C11,Inputs!N16+1),MAX(Reference!C11,C16+1))))","v":40},{"$f":"IF(Inputs!D16<>0,\"N/A -- Case 2\",IF(Inputs!N16>0,MAX(D16-Inputs!N16,1),MAX(D16-C16,1))*Inputs!L16*5.39)","v":0},{"$f":"IF(Inputs!J16>(Inputs!C16*1.547),IF(Inputs!F16=0,\"0\", MIN(110,(((Inputs!L16*D16)-(Inputs!K16*(IF(Inputs!N16>0,Inputs!N16,C16))))/(Inputs!F16*1.547)))),IF(Inputs!J16<(Inputs!C16*1.547), \"Targ: \"& D16,0))","v":0},null,{"$f":"Inputs!F16","v":0},{"$f":"Inputs!I16","v":1},null," Jan  1-31  ",45.7]
[null," Feb  1-29   ",35,{"$f":"MIN(L17,(IF(Inputs!N17>0,MAX(Reference!C12,Inputs!N17+1),MAX(Reference!C12,C17+1))))","v":40},{"$f":"IF(Inputs!D17<>0,\"N/A -- Case 2\",IF(Inputs!N17>0,MAX(D17-Inputs!N17,1),MAX(D17-C17,1))*Inputs!L17*5.39)","v":0},{"$f":"IF(Inputs!J17>(Inputs!C17*1.547),IF(Inputs!F17=0,\"0\", MIN(110,(((Inputs!L17*D17)-(Inputs!K17*(IF(Inputs!N17>0,Inputs!N17,C17))))/(Inputs!F17*1.547)))),IF(Inputs!J17<(Inputs!C17*1.547), \"Targ: \"& D17,0))","v":0},null,{"$f":"Inputs!F17","v":0},{"$f":"Inputs!I17","v":1},null," Feb  1-29   ",43.9]
[null," Mar  1-31  ",40,{"$f":"MIN(L18,(IF(Inputs!N18>0,MAX(Reference!C13,Inputs!N18+1),MAX(Reference!C13,C18+1))))","v":46},{"$f":"IF(Inputs!D18<>0,\"N/A -- Case 2\",IF(Inputs!N18>0,MAX(D18-Inputs!N18,1),MAX(D18-C18,1))*Inputs!L18*5.39)","v":0},{"$f":"IF(Inputs!J18>(Inputs!C18*1.547),IF(Inputs!F18=0,\"0\", MIN(110,(((Inputs!L18*D18)-(Inputs!K18*(IF(Inputs!N18>0,Inputs!N18,C18))))/(Inputs!F18*1.547)))),IF(Inputs!J18<(Inputs!C18*1.547), \"Targ: \"& D18,0))","v":0},null,{"$f":"Inputs!F18","v":0},{"$f":"Inputs!I18","v":1},null," Mar  1-31  ",51.2]
[null," Apr  1-15",47,{"$f":"MIN(L19,(IF(Inputs!N19>0,MAX(Reference!C14,Inputs!N19+1),MAX(Reference!C14,C19+1))))","v":52},{"$f":"IF(Inputs!D19<>0,\"N/A -- Case 2\",IF(Inputs!N19>0,MAX(D19-Inputs!N19,1),MAX(D19-C19,1))*Inputs!L19*5.39)","v":0},{"$f":"IF(Inputs!J19>(Inputs!C19*1.547),IF(Inputs!F19=0,\"0\", MIN(110,(((Inputs!L19*D19)-(Inputs!K19*(IF(Inputs!N19>0,Inputs!N19,C19))))/(Inputs!F19*1.547)))),IF(Inputs!J19<(Inputs!C19*1.547), \"Targ: \"& D19,0))","v":0},null,{"$f":"Inputs!F19","v":0},{"$f":"Inputs!I19","v":1},null," Apr  1-15",61.2]
[null," Apr 16-30     ",53,{"$f":"MIN(L20,(IF(Inputs!N20>0,MAX(Reference!C15,Inputs!N20+1),MAX(Reference!C15,C20+1))))","v":58},{"$f":"IF(Inputs!D20<>0,\"N/A -- Case 2\",IF(Inputs!N20>0,MAX(D20-Inputs!N20,1),MAX(D20-C20,1))*Inputs!L20*5.39)","v":0},{"$f":"IF(Inputs!J20>(Inputs!C20*1.547),IF(Inputs!F20=0,\"0\", MIN(110,(((Inputs!L20*D20)-(Inputs!K20*(IF(Inputs!N20>0,Inputs!N20,C20))))/(Inputs!F20*1.547)))),IF(Inputs!J20<(Inputs!C20*1.547), \"Targ: \"& D20,0))","v":0},null,{"$f":"Inputs!F20","v":0},{"$f":"Inputs!I20","v":1},null," Apr 16-30     ",61.2]
{"$rows_left_out":15}
{"sheet":"Reference","index":7,"n_rows":36,"n_cols":12,"rows_kept":36,"cut":false,"hidden":false,"merged":[[34,1,34,2],[31,1,31,2],[32,1,32,2],[33,1,33,2]]}
[null,null,null,null,null,null,null,null,null,null,null,{"$f":"Instructions!$K$2","v":"Thermal Limits Spreadsheet"}]
[null,null,null,null,null,null,null,null,null,null,null,{"$f":"Instructions!$K$3","v":"Version 1.0, April 2024"}]
[]
[]
[]
[]
[]
[]
[null,"Semi-Monthly","WWF Criteria","CWF Criteria","TSF Criteria",null,null,"Q7-10 Multipliers",null,"Default Ambient Stream Temperature (°F)"]
[null,"Increment","(ºF)","(ºF)","(ºF)",null,null,"(Default Values)",null,"WWF","CWF","TSF"]
[null," Jan  1-31  ",40,38,40,null,null,3.2,null,35,34,34]
[null," Feb  1-29   ",40,38,40,null,null,3.5,null,35,35,35]
[null," Mar  1-31  ",46,42,46,null,null,7,null,40,39,39]
[null," Apr  1-15",52,48,52,null,null,9.3000000000000007,null,47,46,46]
[null," Apr 16-30     ",58,52,58,null,null,9.3000000000000007,null,53,52,52]
[null," May  1-15   ",64,54,64,null,null,5.0999999999999996,null,58,55,56]
[null," May 16-31   ",72,58,68,null,null,5.0999999999999996,null,62,59,60]
[null," Jun  1-15     ",80,60,70,null,null,3,null,67,63,65]
[null," Jun 16-30",84,64,72,null,null,3,null,71,67,69]
[null," Jul  1-31      ",87,66,74,null,null,1.7,null,75,71,73]
{"$rows_left_out":17}
{"sheet":"Versions","index":8,"n_rows":2,"n_cols":3,"rows_kept":2,"cut":false,"hidden":false,"merged":[]}
["Date","Version","Change(s)"]
["2024-04-03",1,"Original"]