{"text_format":"1","workbook":"xlsx","n_sheets":5,"sheets":["Instructions","Major Sewage","Industrial","Other Discharges","Reference"],"not_rendered":{"charts":0,"images":0,"macros":1,"external_links":0,"defined_names":32,"comments":0,"pivot_tables":0},"unopened":[],"bounds":{"document_bytes":16777216,"sheet_cells":100000,"rows_first":2000,"rows_last":500,"rows_between":2000,"halvings":0,"cell_chars":16384,"cell_head_chars":4096},"cells_cut":0,"cells_raw":0,"read":"whole","date_system":"1900"}

{"sheet":"Instructions","index":0,"n_rows":52,"n_cols":4,"rows_kept":52,"cut":false,"hidden":false,"merged":[[43,1,43,35],[17,2,17,35],[46,2,49,35],[38,3,40,35],[20,3,23,35],[28,3,30,35],[24,3,24,35],[25,3,26,35],[0,1,0,35],[3,1,3,35],[1,1,1,35],[2,1,2,35],[19,2,19,35],[4,2,8,35],[51,2,56,35],[50,2,50,35],[57,0,57,36],[31,2,31,35],[0,0,48,0],[13,1,13,35],[37,1,37,35],[14,2,14,35],[18,3,18,35],[16,2,16,35],[32,3,36,35],[42,2,42,35],[44,2,44,35],[10,2,12,35],[15,2,15,35],[0,36,48,36]]}
[]
[null,"INSTRUCTIONS FOR COMPLETING"]
[null,"TOXICS SCREENING ANALYSIS"]
[]
[null,null,"This spreadsheet may be used to evaluate toxic parameters of concern for water quality modeling and to facilitate determinations of \"reasonable potential\" to cause an excursion above water quality standards, in accordance with the SOPs for Establishing Effluent Limits.  Every parameter that is listed with at least one water quality criterion in Chapter 93 is available for selection plus others.  In addition, parameters with provisional criteria may be manually entered by users.  Questions on the use of this spreadsheet can be directed to the Bureau of Clean Water, NPDES Permitting Division, at (717) 787-5017."]
[]
[]
[]
[]
[]
[null,null,"There are 3 possible worksheets that can be used - \"Major Sewage\" (contains a list of some Group 1 and all Groups 2 - 7 parameters from the Major Sewage application), \"Industrial\" (contains a list of some Group 1 and all Groups 2 - 7 parameters from the Industrial Waste application), and \"Other Discharges\" (may be used for manually entering parameters)."]
[]
[]
[]
[null,null,"General Instructions"]
[]
[null,null,"The fields and columns that are available to users for data input are highlighted in yellow. "]
[]
[null,null,"1.","Enter the name of the facility, the NPDES permit number, the applicable outfall number, and the discharge flow1 (\"design flow\" in MGD)."]
[]
[null,null,"2.","If necessary, modify the Analysis Hardness (mg/L as CaCO3) and pH (S.U.).  These values are used to calculate criteria for certain parameters and are based on in-stream hardness and pH following mixing with the receiving water.  On the Reference worksheet you must select the name of the worksheet you are working on in order for the Analysis Hardness and pH values to be used to calculate criteria for hardness- and pH-dependent parameters (e.g., metals). "]
[]
[]
[]
[]
[null,null,"3. ","Enter the Discharge Flow (MGD) and Stream Flow (cfs). These values are used to determine the amount of assimilative capacity the stream will provide.  The determination of whether a parameter is a candidate for modeling in PENTOXSD is based partly on available assimilative capacity."]
[]
[]
[null,null,"4.","If using the \"Other Discharges\" worksheet, select parameters from the drop-down menus within the \"Parameter\" column.  The most stringent criterion in Chapter 93 is automatically displayed.  (The parameters and criteria are pre-populated for the \"Major Sewage\" and \"Industrial\" worksheets)."]
[]
[]
[]
[null,null,"5.","Enter the maximum concentration reported in the permit application or Discharge Monitoring Reports (DMRs) in the column labeled \"Maximum Concentration in Application or DMRs (µg/L).\"  Make sure the values are in terms of µg/L.  Alternatively, if there are sufficient data (10 or more data points), enter the \"AMEC\" concentration calculated by the TOXCONC.xls spreadsheet.  If the maximum concentration is a \"non-detect\" result, enter the less than symbol (<) in the left side of the cell (double-click to toggle < on and off).  The program will evaluate whether the parameter is a candidate for PENTOXSD modeling based on the entered maximum value, the Target Quantitation Limit (QL), and the most stringent Chapter 93 criterion.  Possible values are \"Yes\", \"No\", and \"No (Value < QL)\"."]
[]
[]
[]
[]
[]
[null,null,"6.","After PENTOXSD modeling for the candidate pollutants, enter the most stringent WQBEL into the column of the same name.  The program then provides a recommendation for how to treat the parameter in the permit.  Possible values are \"No Limits/Monitoring\" (no limits or monitoring recommended), \"Establish Limits\", and \"Monitor\".  The logic is based on procedures in DEP's SOPs."]
[]
[]
[]
[null,null,"Reference Worksheet"]
[]
[null,null,"The columns that are available to users for data input are highlighted in yellow."]
[]
[null,null,"All available water quality criteria and Target QLs for parameters identified in Chapter 93 can be found in this table, as well as other parameters that do not have criteria.  Users may add provisional criteria and new chemicals to the bottom of the list.  Once entered, the new parameter(s) should be available in the drop-down menus in the worksheets.  Users may also indicate \"Y\" where they believe a parameter should be treated conservatively, if not already indicated."]
[]
[]
[]
[]
[null,null,"1 - Discharge flow is used as part of a screening analysis for Total Dissolved Solids (TDS), Bromide and 1,4-Dioxane.  Bromide and 1,4-Dioxane do not have Chapter 93 criteria but have been identified as potential pollutants of concern that may warrant monitoring in permits.  The screening thresholds for Bromide are 1 mg/L (for discharge flows > 0.1 MGD) and 10 mg/L (for discharge flows <= 0.1 MGD).  The screening thresholds for 1,4-Dioxane are 0.01 mg/L (for discharge flows > 0.1 MGD) and 0.1 mg/L (for discharge flows <= 0.1 MGD).  The screening thresholds for TDS are 1,000 mg/L or 20,000 lbs/day (for discharge flows > 0.1 MGD) and 5,000 mg/L (for discharge flows <= 0.1 MGD). If TDS will be monitored, the Toxics Screening Analysis spreadsheet automatically recommends that Sulfate, Chloride and Bromide be monitored as well."]

{"sheet":"Major Sewage","index":1,"n_rows":162,"n_cols":46,"rows_kept":162,"cut":false,"hidden":false,"merged":[[162,0,162,37],[6,11,6,18],[6,19,6,24],[6,25,6,27],[6,28,6,29],[6,30,6,34],[6,35,6,36],[5,19,5,24],[5,15,5,18],[5,25,5,29],[5,30,5,32],[0,0,161,0],[0,2,0,36],[1,2,1,36],[2,2,2,36],[3,2,3,36],[5,2,5,4],[5,5,5,14],[5,33,5,34],[11,2,11,11],[11,13,11,18],[11,19,11,22],[11,23,11,27],[11,28,11,31],[11,32,11,36],[5,35,5,36],[6,9,6,10],[9,2,10,11],[9,12,10,18],[9,19,10,22],[9,23,10,27],[9,28,10,31],[9,32,10,36],[7,9,7,10],[13,2,13,11],[13,13,13,18],[13,19,13,22],[13,23,13,27],[13,28,13,31],[13,32,13,36],[12,2,12,11],[12,13,12,18],[12,19,12,22],[12,23,12,27],[12,28,12,31],[12,32,12,36],[15,13,15,18],[15,19,15,22],[15,23,15,27],[15,28,15,31],[15,32,15,36],[14,2,14,11],[14,13,14,18],[14,19,14,22],[14,23,14,27],[14,28,14,31],[14,32,14,36],[17,13,17,18],[17,19,17,22],[17,23,17,27],[17,28,17,31],[17,32,17,36],[16,2,16,11],[16,13,16,18],[16,19,16,22],[16,23,16,27],[16,28,16,31],[16,32,16,36],[19,13,19,18],[19,19,19,22],[19,23,19,27],[19,28,19,31],[19,32,19,36],[18,2,18,11],[18,13,18,18],[18,19,18,22],[18,23,18,27],[18,28,18,31],[18,32,18,36],[21,13,21,18],[21,19,21,22],[21,23,21,27],[21,28,21,31],[21,32,21,36],[20,2,20,11],[20,13,20,18],[20,19,20,22],[20,23,20,27],[20,28,20,31],[20,32,20,36],[23,13,23,18],[23,19,23,22],[23,23,23,27],[23,28,23,31],[23,32,23,36],[22,2,22,11],[22,13,22,18],[22,19,22,22],[22,23,22,27],[22,28,22,31],[22,32,22,36],[25,13,25,18],[25,19,25,22],[25,23,25,27],[25,28,25,31],[25,32,25,36],[24,2,24,11],[24,13,24,18],[24,19,24,22],[24,23,24,27],[24,28,24,31],[24,32,24,36],[27,13,27,18],[27,19,27,22],[27,23,27,27],[27,28,27,31],[27,32,27,36],[26,2,26,11],[26,13,26,18],[26,19,26,22],[26,23,26,27],[26,28,26,31],[26,32,26,36],[29,13,29,18],[29,19,29,22],[29,23,29,27],[29,28,29,31],[29,32,29,36],[28,2,28,11],[28,13,28,18],[28,19,28,22],[28,23,28,27],[28,28,28,31],[28,32,28,36],[31,13,31,18],[31,19,31,22],[31,23,31,27],[31,28,31,31],[31,32,31,36],[30,2,30,11],[30,13,30,18],[30,19,30,22],[30,23,30,27],[30,28,30,31],[30,32,30,36],[33,13,33,18],[33,19,33,22],[33,23,33,27],[33,28,33,31],[33,32,33,36],[32,2,32,11],[32,13,32,18],[32,19,32,22],[32,23,32,27],[32,28,32,31],[32,32,32,36],[35,13,35,18],[35,19,35,22],[35,23,35,27],[35,28,35,31],[35,32,35,36],[34,2,34,11],[34,13,34,18],[34,19,34,22],[34,23,34,27],[34,28,34,31],[34,32,34,36],[37,13,37,18],[37,19,37,22],[37,23,37,27],[37,28,37,31],[37,32,37,36],[36,2,36,11],[36,13,36,18],[36,19,36,22],[36,23,36,27],[36,28,36,31],[36,32,36,36],[39,13,39,18],[39,19,39,22],[39,23,39,27],[39,28,39,31],[39,32,39,36],[38,2,38,11],[38,13,38,18],[38,19,38,22],[38,23,38,27],[38,28,38,31],[38,32,38,36],[65,13,65,18],[65,19,65,22],[65,23,65,27],[65,28,65,31],[65,32,65,36],[64,2,64,11],[64,13,64,18],[64,19,64,22],[64,23,64,27],[64,28,64,31],[64,32,64,36],[67,13,67,18],[67,19,67,22],[67,23,67,27],[67,28,67,31],[67,32,67,36],[66,2,66,11],[66,13,66,18],[66,19,66,22],[66,23,66,27],[66,28,66,31],[66,32,66,36],[155,2,155,11],[155,13,155,18],[155,19,155,22],[155,23,155,27],[155,28,155,31],[155,32,155,36],[68,2,68,11],[68,13,68,18],[68,19,68,22],[68,23,68,27],[68,28,68,31],[68,32,68,36],[75,2,75,11],[76,2,76,11],[77,2,77,11],[78,2,78,11],[79,2,79,11],[80,2,80,11],[69,2,69,11],[70,2,70,11],[71,2,71,11],[72,2,72,11],[73,2,73,11],[74,2,74,11],[157,2,157,11],[157,13,157,18],[157,19,157,22],[157,23,157,27],[157,28,157,31],[157,32,157,36],[156,2,156,11],[156,13,156,18],[156,19,156,22],[156,23,156,27],[156,28,156,31],[156,32,156,36],[159,2,159,11],[159,13,159,18],[159,19,159,22],[159,23,159,27],[159,28,159,31],[159,32,159,36],[158,2,158,11],[158,13,158,18],[158,19,158,22],[158,23,158,27],[158,28,158,31],[158,32,158,36],[161,2,161,11],[161,13,161,18],[161,19,161,22],[161,23,161,27],[161,28,161,31],[161,32,161,36],[160,2,160,11],[160,13,160,18],[160,19,160,22],[160,23,160,27],[160,28,160,31],[160,32,160,36],[11,1,14,1],[15,1,39,1],[40,2,40,11],[41,2,41,11],[42,2,42,11],[43,2,43,11],[40,1,68,1],[67,2,67,11],[65,2,65,11],[39,2,39,11],[37,2,37,11],[35,2,35,11],[33,2,33,11],[31,2,31,11],[29,2,29,11],[27,2,27,11],[25,2,25,11],[23,2,23,11],[21,2,21,11],[19,2,19,11],[17,2,17,11],[15,2,15,11],[52,2,52,11],[53,2,53,11],[54,2,54,11],[55,2,55,11],[44,2,44,11],[45,2,45,11],[46,2,46,11],[47,2,47,11],[48,2,48,11],[49,2,49,11],[48,19,48,22],[49,19,49,22],[50,19,50,22],[51,19,51,22],[52,19,52,22],[53,19,53,22],[51,13,51,18],[62,2,62,11],[63,2,63,11],[40,19,40,22],[41,19,41,22],[42,19,42,22],[43,19,43,22],[44,19,44,22],[45,19,45,22],[46,19,46,22],[47,19,47,22],[56,2,56,11],[57,2,57,11],[58,2,58,11],[59,2,59,11],[60,2,60,11],[61,2,61,11],[50,2,50,11],[51,2,51,11],[63,19,63,22],[46,13,46,18],[47,13,47,18],[48,13,48,18],[49,13,49,18],[50,13,50,18],[63,23,63,27],[40,23,40,27],[41,23,41,27],[42,23,42,27],[43,23,43,27],[44,23,44,27],[45,23,45,27],[54,19,54,22],[55,19,55,22],[56,19,56,22],[46,23,46,27],[47,23,47,27],[48,23,48,27],[49,23,49,27],[50,23,50,27],[52,23,52,27],[53,23,53,27],[54,23,54,27],[55,23,55,27],[56,23,56,27],[57,19,57,22],[58,19,58,22],[59,19,59,22],[61,28,61,31],[62,28,62,31],[60,19,60,22],[61,19,61,22],[62,19,62,22],[58,23,58,27],[59,23,59,27],[60,23,60,27],[61,23,61,27],[62,23,62,27],[63,28,63,31],[51,23,51,27],[40,28,40,31],[41,28,41,31],[42,28,42,31],[43,28,43,31],[44,28,44,31],[45,28,45,31],[58,28,58,31],[59,28,59,31],[60,28,60,31],[52,28,52,31],[53,28,53,31],[54,28,54,31],[55,28,55,31],[56,28,56,31],[57,28,57,31],[57,23,57,27],[46,28,46,31],[47,28,47,31],[48,28,48,31],[49,28,49,31],[50,28,50,31],[51,28,51,31],[46,32,46,36],[47,32,47,36],[48,32,48,36],[49,32,49,36],[50,32,50,36],[51,32,51,36],[40,32,40,36],[41,32,41,36],[42,32,42,36],[43,32,43,36],[44,32,44,36],[45,32,45,36],[58,32,58,36],[59,32,59,36],[60,32,60,36],[61,32,61,36],[62,32,62,36],[63,32,63,36],[52,32,52,36],[53,32,53,36],[54,32,54,36],[55,32,55,36],[56,32,56,36],[57,32,57,36],[40,13,40,18],[41,13,41,18],[42,13,42,18],[43,13,43,18],[44,13,44,18],[45,13,45,18],[58,13,58,18],[59,13,59,18],[60,13,60,18],[61,13,61,18],[62,13,62,18],[63,13,63,18],[52,13,52,18],[53,13,53,18],[54,13,54,18],[55,13,55,18],[56,13,56,18],[57,13,57,18],[89,2,89,11],[90,2,90,11],[91,2,91,11],[92,2,92,11],[81,2,81,11],[82,2,82,11],[83,2,83,11],[84,2,84,11],[85,2,85,11],[86,2,86,11],[153,2,153,11],[154,2,154,11],[69,13,69,18],[70,13,70,18],[71,13,71,18],[72,13,72,18],[73,13,73,18],[117,2,117,11],[118,2,118,11],[119,2,119,11],[120,2,120,11],[121,2,121,11],[122,2,122,11],[111,2,111,11],[112,2,112,11],[113,2,113,11],[114,2,114,11],[115,2,115,11],[116,2,116,11],[105,2,105,11],[106,2,106,11],[107,2,107,11],[108,2,108,11],[109,2,109,11],[74,13,74,18],[75,13,75,18],[76,13,76,18],[77,13,77,18],[78,13,78,18],[79,13,79,18],[123,2,123,11],[124,2,124,11],[125,2,125,11],[110,2,110,11],[99,2,99,11],[100,2,100,11],[101,2,101,11],[102,2,102,11],[103,2,103,11],[104,2,104,11],[93,2,93,11],[94,2,94,11],[95,2,95,11],[96,2,96,11],[97,2,97,11],[98,2,98,11],[87,2,87,11],[88,2,88,11],[86,13,86,18],[87,13,87,18],[88,13,88,18],[89,13,89,18],[90,13,90,18],[91,13,91,18],[80,13,80,18],[81,13,81,18],[82,13,82,18],[83,13,83,18],[84,13,84,18],[85,13,85,18],[101,13,101,18],[102,13,102,18],[103,13,103,18],[92,13,92,18],[93,13,93,18],[94,13,94,18],[95,13,95,18],[96,13,96,18],[97,13,97,18],[125,13,125,18],[153,13,153,18],[154,13,154,18],[116,13,116,18],[117,13,117,18],[118,13,118,18],[119,13,119,18],[120,13,120,18],[121,13,121,18],[69,19,69,22],[70,19,70,22],[71,19,71,22],[72,19,72,22],[73,19,73,22],[74,19,74,22],[122,13,122,18],[123,13,123,18],[124,13,124,18],[110,13,110,18],[111,13,111,18],[112,13,112,18],[113,13,113,18],[114,13,114,18],[115,13,115,18],[104,13,104,18],[105,13,105,18],[106,13,106,18],[107,13,107,18],[108,13,108,18],[109,13,109,18],[98,13,98,18],[99,13,99,18],[100,13,100,18],[154,19,154,22],[69,23,69,27],[70,23,70,27],[71,23,71,27],[72,23,72,27],[73,23,73,27],[117,19,117,22],[118,19,118,22],[119,19,119,22],[120,19,120,22],[121,19,121,22],[122,19,122,22],[111,19,111,22],[112,19,112,22],[113,19,113,22],[114,19,114,22],[115,19,115,22],[116,19,116,22],[105,19,105,22],[106,19,106,22],[107,19,107,22],[108,19,108,22],[109,19,109,22],[89,19,89,22],[96,19,96,22],[97,19,97,22],[98,19,98,22],[87,19,87,22],[88,19,88,22],[153,19,153,22],[90,19,90,22],[91,19,91,22],[92,19,92,22],[123,19,123,22],[124,19,124,22],[125,19,125,22],[110,19,110,22],[99,19,99,22],[100,19,100,22],[101,19,101,22],[102,19,102,22],[103,19,103,22],[104,19,104,22],[74,23,74,27],[75,23,75,27],[76,23,76,27],[77,23,77,27],[78,23,78,27],[79,23,79,27],[93,19,93,22],[94,19,94,22],[95,19,95,22],[81,19,81,22],[82,19,82,22],[83,19,83,22],[84,19,84,22],[85,19,85,22],[86,19,86,22],[75,19,75,22],[76,19,76,22],[77,19,77,22],[78,19,78,22],[79,19,79,22],[80,19,80,22],[86,23,86,27],[87,23,87,27],[88,23,88,27],[89,23,89,27],[90,23,90,27],[91,23,91,27],[80,23,80,27],[81,23,81,27],[82,23,82,27],[83,23,83,27],[84,23,84,27],[85,23,85,27],[110,23,110,27],[111,23,111,27],[112,23,112,27],[113,23,113,27],[114,23,114,27],[115,23,115,27],[106,23,106,27],[107,23,107,27],[108,23,108,27],[109,23,109,27],[125,23,125,27],[153,23,153,27],[154,23,154,27],[116,23,116,27],[117,23,117,27],[118,23,118,27],[119,23,119,27],[120,23,120,27],[121,23,121,27],[122,23,122,27],[123,23,123,27],[124,23,124,27],[92,28,92,31],[104,23,104,27],[105,23,105,27],[98,23,98,27],[99,23,99,27],[100,23,100,27],[101,23,101,27],[102,23,102,27],[103,23,103,27],[92,23,92,27],[93,23,93,27],[94,23,94,27],[95,23,95,27],[96,23,96,27],[97,23,97,27],[69,28,69,31],[70,28,70,31],[71,28,71,31],[72,28,72,31],[73,28,73,31],[74,28,74,31],[89,28,89,31],[90,28,90,31],[91,28,91,31],[81,28,81,31],[82,28,82,31],[83,28,83,31],[84,28,84,31],[85,28,85,31],[86,28,86,31],[75,28,75,31],[76,28,76,31],[77,28,77,31],[78,28,78,31],[79,28,79,31],[80,28,80,31],[153,28,153,31],[154,28,154,31],[69,32,69,36],[70,32,70,36],[71,32,71,36],[72,32,72,36],[73,32,73,36],[117,28,117,31],[118,28,118,31],[119,28,119,31],[120,28,120,31],[121,28,121,31],[122,28,122,31],[111,28,111,31],[112,28,112,31],[113,28,113,31],[114,28,114,31],[115,28,115,31],[116,28,116,31],[105,28,105,31],[106,28,106,31],[107,28,107,31],[108,28,108,31],[109,28,109,31],[74,32,74,36],[75,32,75,36],[76,32,76,36],[77,32,77,36],[78,32,78,36],[79,32,79,36],[123,28,123,31],[124,28,124,31],[125,28,125,31],[110,28,110,31],[99,28,99,31],[100,28,100,31],[101,28,101,31],[102,28,102,31],[103,28,103,31],[104,28,104,31],[93,28,93,31],[94,28,94,31],[95,28,95,31],[96,28,96,31],[97,28,97,31],[98,28,98,31],[87,28,87,31],[88,28,88,31],[86,32,86,36],[87,32,87,36],[88,32,88,36],[89,32,89,36],[90,32,90,36],[91,32,91,36],[80,32,80,36],[81,32,81,36],[82,32,82,36],[83,32,83,36],[84,32,84,36],[85,32,85,36],[153,32,153,36],[93,32,93,36],[94,32,94,36],[95,32,95,36],[96,32,96,36],[97,32,97,36],[150,32,150,36],[148,32,148,36],[154,32,154,36],[116,32,116,36],[117,32,117,36],[118,32,118,36],[119,32,119,36],[120,32,120,36],[121,32,121,36],[110,32,110,36],[111,32,111,36],[112,32,112,36],[113,32,113,36],[114,32,114,36],[115,32,115,36],[149,32,149,36],[147,32,147,36],[69,1,79,1],[80,1,125,1],[126,2,126,11],[126,13,126,18],[126,19,126,22],[126,23,126,27],[126,1,144,1],[122,32,122,36],[123,32,123,36],[124,32,124,36],[125,32,125,36],[104,32,104,36],[105,32,105,36],[106,32,106,36],[107,32,107,36],[108,32,108,36],[109,32,109,36],[98,32,98,36],[99,32,99,36],[100,32,100,36],[101,32,101,36],[102,32,102,36],[103,32,103,36],[92,32,92,36],[128,2,128,11],[128,13,128,18],[128,19,128,22],[128,23,128,27],[128,28,128,31],[128,32,128,36],[126,28,126,31],[126,32,126,36],[127,2,127,11],[127,13,127,18],[127,19,127,22],[127,23,127,27],[127,28,127,31],[127,32,127,36],[130,2,130,11],[130,13,130,18],[130,19,130,22],[130,23,130,27],[130,28,130,31],[130,32,130,36],[129,2,129,11],[129,13,129,18],[129,19,129,22],[129,23,129,27],[129,28,129,31],[129,32,129,36],[132,2,132,11],[132,13,132,18],[132,19,132,22],[132,23,132,27],[132,28,132,31],[132,32,132,36],[131,2,131,11],[131,13,131,18],[131,19,131,22],[131,23,131,27],[131,28,131,31],[131,32,131,36],[134,2,134,11],[134,13,134,18],[134,19,134,22],[134,23,134,27],[134,28,134,31],[134,32,134,36],[133,2,133,11],[133,13,133,18],[133,19,133,22],[133,23,133,27],[133,28,133,31],[133,32,133,36],[136,2,136,11],[136,13,136,18],[136,19,136,22],[136,23,136,27],[136,28,136,31],[136,32,136,36],[135,2,135,11],[135,13,135,18],[135,19,135,22],[135,23,135,27],[135,28,135,31],[135,32,135,36],[138,2,138,11],[138,13,138,18],[138,19,138,22],[138,23,138,27],[138,28,138,31],[138,32,138,36],[137,2,137,11],[137,13,137,18],[137,19,137,22],[137,23,137,27],[137,28,137,31],[137,32,137,36],[140,2,140,11],[140,13,140,18],[140,19,140,22],[140,23,140,27],[140,28,140,31],[140,32,140,36],[139,2,139,11],[139,13,139,18],[139,19,139,22],[139,23,139,27],[139,28,139,31],[139,32,139,36],[142,2,142,11],[142,13,142,18],[142,19,142,22],[142,23,142,27],[142,28,142,31],[142,32,142,36],[141,2,141,11],[141,13,141,18],[141,19,141,22],[141,23,141,27],[141,28,141,31],[141,32,141,36],[144,2,144,11],[144,13,144,18],[144,19,144,22],[144,23,144,27],[144,28,144,31],[144,32,144,36],[143,2,143,11],[143,13,143,18],[143,19,143,22],[143,23,143,27],[143,28,143,31],[143,32,143,36],[146,2,146,11],[146,13,146,18],[146,19,146,22],[146,23,146,27],[146,28,146,31],[146,32,146,36],[145,2,145,11],[145,13,145,18],[145,19,145,22],[145,23,145,27],[145,28,145,31],[145,32,145,36],[149,28,149,31],[148,2,148,11],[148,13,148,18],[148,19,148,22],[148,23,148,27],[148,28,148,31],[147,2,147,11],[147,13,147,18],[147,19,147,22],[147,23,147,27],[147,28,147,31],[4,2,4,36],[8,2,8,36],[145,1,149,1],[152,2,152,11],[152,13,152,18],[152,19,152,22],[152,23,152,27],[152,28,152,31],[152,32,152,36],[151,2,151,11],[151,13,151,18],[151,19,151,22],[151,23,151,27],[151,28,151,31],[151,32,151,36],[150,2,150,11],[150,13,150,18],[150,19,150,22],[150,23,150,27],[150,28,150,31],[149,2,149,11],[149,13,149,18],[149,19,149,22],[149,23,149,27]]}
[null,null,null,null,null,null,null,null,null,null,null,null,null,null,null,null,null,null,null,null,null,null,null,null,null,null,null,null,null,null,null,null,null,null,null,null,null,null,null,"<"]
[null,null,"TOXICS SCREENING ANALYSIS"]
[null,null,"WATER QUALITY POLLUTANTS OF CONCERN"]
[null,null,"VERSION 2.7"]
[null,null," "]
[null,null,"Facility:",null,null,null,null,null,null,null,null,null,null,null,null,null,null,null,null,"NPDES Permit No.:",null,null,null,null,null,null,null,null,null,null,null,null,null,"Outfall:"]
[null,null,"Analysis Hardness (mg/L):",null,null,null,null,null,null,100,null,null,null,null,null,null,null,null,null,"Discharge Flow (MGD):",null,null,null,null,null,null,null,null,null,null,"Analysis pH (SU):",null,null,null,null,7,null,null,null,"Stream Flow (MGD)",null,{"$f":"IF(J8<>\"\",IF(J8<>0,J8*0.64631,0.000001),\"\")","v":""}]
[null,null,"Stream Flow, Q7-10 (cfs):",null,null,null,null,null,null,null,null,null,null,null,null,null,null,null,null,null,null,null,null,null,null,null,null,null,null,null,null,null,null,null,null,null,null,null,null,"Stream:Discharge",null,{"$f":"IF(AND(AP7<>\"\",Z7<>\"\"),AP7/Z7,\"\")","v":""}]
[null,null,null,null,null,null,null,null,null,null,null,null,null,null,null,null,null,null,null,null,null,null,null,null,null,null,null,null,null,null,null,null,null,null,null,null,null,null,null,"Assimilative Capacity?",null,{"$f":"IF(AP7=0,\"No\",IF(AP8<3,\"No\",\"Yes\"))","v":"Yes"}]
[null,null,"Parameter",null,null,null,null,null,null,null,null,null,"Maximum Concentration in Application or DMRs (µg/L)",null,null,null,null,null,null,"Most Stringent Criterion (µg/L)",null,null,null,"Candidate for PENTOXSD Modeling?",null,null,null,null,"Most Stringent WQBEL (µg/L)",null,null,null,"Screening Recommendation"]
[null,null,null,null,null,null,null,null,null,null,null,null,null,null,null,null,null,null,null,null,null,null,null,null,null,null,null,null,null,null,null,null,null,null,null,null,null,null,null,"QL","Conservative?","BCS1M Screen 1","Screening Low","Screening High","BCS1M Screen 2","Final Rec."]
[null,"Group 1","Total Dissolved Solids",null,null,null,null,null,null,null,null,null,null,null,null,null,null,null,null,{"$f":"IF(C12<>\"\",IF(VLOOKUP(C12,Reference!$A$3:$B$188,2,FALSE)=\"\",\"N/A\",VLOOKUP(C12,Reference!$A$3:$B$188,2,FALSE)),\"\")","v":500000},null,null,null,{"$f":"IF(AND(C12<>\"\",N12<>\"\",$J$8<>\"\",$Z$7<>\"\"),IF(T12<>\"N/A\",IF(AND(N12<=VALUE(AN12),M12=\"<\"),\"No (Value < QL)\",IF($AP$9=\"No\",IF(N12>=(0.5*T12),IF(AND(M12=\"<\",N12=(0.5*T12)),\"No\",\"Yes\"),\"No\"),IF(N12>=T12,IF(AND(M12=\"<\",N12=T12),\"No\",\"Yes\"),\"No\"))),\"No\"),\"\")","v":""},null,null,null,null,null,null,null,null,{"$f":"IF($N12<>\"\",AT12,\"\")","v":""},null,null,null,null,null,null,{"$f":"IF(C12<>\"\",IF(VLOOKUP(C12,Reference!$I$3:$J$188,2,FALSE)=\" \",0,VLOOKUP(C12,Reference!$I$3:$J$188,2,FALSE)),\"\")","v":2000},{"$f":"IF(C12<>\"\",IF(VLOOKUP(C12,Reference!$M$3:$Q$188,5,FALSE)=\" \",0,VLOOKUP(C12,Reference!$M$3:$Q$188,5,FALSE)),\"\")","v":"Y"},{"$f":"IF(AND(X12=\"Yes\",AC12<>\"\"),IF((N12/AC12)>=0.5,\"Establish Limits\",IF(AND(AO12=\"Y\",(N12/AC12)>0.1),\"Monitor\",IF(AND(AO12<>\"Y\",(N12/AC12)>0.25),\"Monitor\",\"No Limits/Monitoring\"))),\"\")","v":""},1000000,5000000,{"$f":"IF(AND(N12<>\"\",$Z$7<>\"\"),IF(OR(AND($Z$7>0.1,N12>AQ12),AND($Z$7<=0.1,N12>AR12),(($Z$7*(N12/1000)*8.34)>20000)),\"Monitor\",\"\"),\"\")","v":""},{"$f":"IF(OR(AP12=\"Establish Limits\",AP12=\"Monitor\"),AP12,IF(AND(AP12=\"No Limits/Monitoring\",AS12=\"Monitor\"),AS12,IF(AND(AP12=\"\",AS12=\"\"),\"\",IF(AND(AP12=\"\",AS12=\"Monitor\"),\"Monitor\",IF(AND(AP12=\"No Limits/Monitoring\",AS12=\"\"),\"No Limits/Monitoring\",\"\")))))","v":""}]
[null,null,"Chloride",null,null,null,null,null,null,null,null,null,null,null,null,null,null,null,null,{"$f":"IF(C13<>\"\",IF(VLOOKUP(C13,Reference!$A$3:$B$188,2,FALSE)=\"\",\"N/A\",VLOOKUP(C13,Reference!$A$3:$B$188,2,FALSE)),\"\")","v":250000},null,null,null,"",null,null,null,null,null,null,null,null,{"$f":"AT13","v":""},null,null,null,null,null,null,{"$f":"IF(C13<>\"\",IF(VLOOKUP(C13,Reference!$I$3:$J$188,2,FALSE)=\" \",0,VLOOKUP(C13,Reference!$I$3:$J$188,2,FALSE)),\"\")","v":500},{"$f":"IF(C13<>\"\",IF(VLOOKUP(C13,Reference!$M$3:$Q$188,5,FALSE)=\" \",0,VLOOKUP(C13,Reference!$M$3:$Q$188,5,FALSE)),\"\")","v":"Y"},{"$f":"IF(AND(X13=\"Yes\",AC13<>\"\"),IF((N13/AC13)>=0.5,\"Establish Limits\",IF(AND(AO13=\"Y\",(N13/AC13)>0.1),\"Monitor\",IF(AND(AO13<>\"Y\",(N13/AC13)>0.25),\"Monitor\",\"No Limits/Monitoring\"))),\"\")","v":""},null,null,null,{"$f":"IF(OR(AP13=\"Establish Limits\",AP13=\"Monitor\"),AP13,IF(AND(AP13=\"\",OR($AT$12=\"No Limits/Monitoring\",$AT$12=\"\")),\"\",IF(AND(OR(AP13=\"\",AP13=\"No Limits/Monitoring\"),OR($AT$12=\"Monitor\",$AT$12=\"Establish Limits\")),\"Monitor\",IF(AND(AP13=\"No Limits/Monitoring\",$AT$12=\"\"),AP13))))","v":""}]
[null,null,"Bromide",null,null,null,null,null,null,null,null,null,null,null,null,null,null,null,null,{"$f":"IF(C14<>\"\",IF(VLOOKUP(C14,Reference!$A$3:$B$188,2,FALSE)=\"\",\"N/A\",VLOOKUP(C14,Reference!$A$3:$B$188,2,FALSE)),\"\")","v":"N/A"},null,null,null,"",null,null,null,null,null,null,null,null,{"$f":"AT14","v":""},null,null,null,null,null,null,{"$f":"IF(C14<>\"\",IF(VLOOKUP(C14,Reference!$I$3:$J$188,2,FALSE)=\" \",0,VLOOKUP(C14,Reference!$I$3:$J$188,2,FALSE)),\"\")","v":200},{"$f":"IF(C14<>\"\",IF(VLOOKUP(C14,Reference!$M$3:$Q$188,5,FALSE)=\" \",0,VLOOKUP(C14,Reference!$M$3:$Q$188,5,FALSE)),\"\")","v":"Y"},"",1000,10000,{"$f":"IF(AND(N14<>\"\",$Z$7<>\"\"),IF(OR(AND($Z$7>0.1,N14>AQ14),AND($Z$7<=0.1,N14>AR14)),\"Monitor\",\"\"),\"\")","v":""},{"$f":"IF(OR(AP14=\"Establish Limits\",AP14=\"Monitor\"),AP14,IF(AND(AP14=\"No Limits/Monitoring\",AS14=\"Monitor\"),AS14,IF(AND(AP14=\"\",AS14=\"\",$AT$12=\"\"),\"\",IF(AND(AP14=\"\",AS14=\"Monitor\"),\"Monitor\",IF(AND(AP14=\"\",AS14=\"\",OR($AT$12=\"Monitor\",$AT$12=\"Establish Limits\")),\"Monitor\",\"\")))))","v":""}]
[null,null,"Sulfate",null,null,null,null,null,null,null,null,null,null,null,null,null,null,null,null,{"$f":"IF(C15<>\"\",IF(VLOOKUP(C15,Reference!$A$3:$B$188,2,FALSE)=\"\",\"N/A\",VLOOKUP(C15,Reference!$A$3:$B$188,2,FALSE)),\"\")","v":250000},null,null,null,"",null,null,null,null,null,null,null,null,{"$f":"AT15","v":""},null,null,null,null,null,null,{"$f":"IF(C15<>\"\",IF(VLOOKUP(C15,Reference!$I$3:$J$188,2,FALSE)=\" \",0,VLOOKUP(C15,Reference!$I$3:$J$188,2,FALSE)),\"\")","v":1000},{"$f":"IF(C15<>\"\",IF(VLOOKUP(C15,Reference!$M$3:$Q$188,5,FALSE)=\" \",0,VLOOKUP(C15,Reference!$M$3:$Q$188,5,FALSE)),\"\")","v":"Y"},{"$f":"IF(AND(X15=\"Yes\",AC15<>\"\"),IF((N15/AC15)>=0.5,\"Establish Limits\",IF(AND(AO15=\"Y\",(N15/AC15)>0.1),\"Monitor\",IF(AND(AO15<>\"Y\",(N15/AC15)>0.25),\"Monitor\",\"No Limits/Monitoring\"))),\"\")","v":""},null,null,null,{"$f":"IF(OR(AP15=\"Establish Limits\",AP15=\"Monitor\"),AP15,IF(AND(AP15=\"\",OR($AT$12=\"No Limits/Monitoring\",$AT$12=\"\")),\"\",IF(AND(OR(AP15=\"\",AP15=\"No Limits/Monitoring\"),OR($AT$12=\"Monitor\",$AT$12=\"Establish Limits\")),\"Monitor\",IF(AND(AP15=\"No Limits/Monitoring\",$AT$12=\"\"),AP15))))","v":""}]
[null,"Group 2","Total Aluminum",null,null,null,null,null,null,null,null,null,null,null,null,null,null,null,null,{"$f":"IF(C16<>\"\",IF(VLOOKUP(C16,Reference!$A$3:$B$188,2,FALSE)=\"\",\"N/A\",VLOOKUP(C16,Reference!$A$3:$B$188,2,FALSE)),\"\")","v":750},null,null,null,"",null,null,null,null,null,null,null,null,{"$f":"IF($N16<>\"\",IF(AND(X16=\"Yes\",AC16<>\"\"),IF(($N16/$AC16)>=0.5,\"Establish Limits\",IF(AND($AO16=\"Y\",($N16/$AC16)>=0.1),\"Monitor\",IF(AND($AO16<>\"Y\",($N16/$AC16)>=0.25),\"Monitor\",\"No Limits/Monitoring\"))),\"\"),\"\")","v":""},null,null,null,null,null,null,{"$f":"IF(C16<>\"\",IF(VLOOKUP(C16,Reference!$I$3:$J$188,2,FALSE)=\" \",0,VLOOKUP(C16,Reference!$I$3:$J$188,2,FALSE)),\"\")","v":10},{"$f":"IF(C16<>\"\",IF(VLOOKUP(C16,Reference!$M$3:$Q$188,5,FALSE)=\" \",0,VLOOKUP(C16,Reference!$M$3:$Q$188,5,FALSE)),\"\")","v":"Y"},{"$f":"IF(AND(X16=\"Yes\",AC16<>\"\"),IF((N16/AC16)>0.5,\"Establish Limits\",IF(AND(AO16=\"Y\",(N16/AC16)>0.1),\"Monitor\",IF(AND(AO16<>\"Y\",(N16/AC16)>0.25),\"Monitor\",\"No Limits/Monitoring\"))),\"\")","v":""}]
[null,null,"Total Antimony",null,null,null,null,null,null,null,null,null,null,null,null,null,null,null,null,{"$f":"IF(C17<>\"\",IF(VLOOKUP(C17,Reference!$A$3:$B$188,2,FALSE)=\"\",\"N/A\",VLOOKUP(C17,Reference!$A$3:$B$188,2,FALSE)),\"\")","v":5.6},null,null,null,{"$f":"IF(AND(C17<>\"\",N17<>\"\",$J$8<>\"\",$Z$7<>\"\"),IF(T17<>\"N/A\",IF(AND(N17<=VALUE(AN17),M17=\"<\"),\"No (Value < QL)\",IF($AP$9=\"No\",IF(N17>=(0.5*T17),IF(AND(M17=\"<\",N17=(0.5*T17)),\"No\",\"Yes\"),\"No\"),IF(N17>=T17,IF(AND(M17=\"<\",N17=T17),\"No\",\"Yes\"),\"No\"))),\"No\"),\"\")","v":""},null,null,null,null,null,null,null,null,{"$f":"IF($N17<>\"\",IF(AND(X17=\"Yes\",AC17<>\"\"),IF(($N17/$AC17)>=0.5,\"Establish Limits\",IF(AND($AO17=\"Y\",($N17/$AC17)>0.1),\"Monitor\",IF(AND($AO17<>\"Y\",($N17/$AC17)>0.25),\"Monitor\",\"No Limits/Monitoring\"))),\"\"),\"\")","v":""},null,null,null,null,null,null,{"$f":"IF(C17<>\"\",IF(VLOOKUP(C17,Reference!$I$3:$J$188,2,FALSE)=\" \",0,VLOOKUP(C17,Reference!$I$3:$J$188,2,FALSE)),\"\")","v":2},{"$f":"IF(C17<>\"\",IF(VLOOKUP(C17,Reference!$M$3:$Q$188,5,FALSE)=\" \",0,VLOOKUP(C17,Reference!$M$3:$Q$188,5,FALSE)),\"\")","v":"Y"},{"$f":"IF(AND(X17=\"Yes\",AC17<>\"\"),IF((N17/AC17)>=0.5,\"Establish Limits\",IF(AND(AO17=\"Y\",(N17/AC17)>0.1),\"Monitor\",IF(AND(AO17<>\"Y\",(N17/AC17)>0.25),\"Monitor\",\"No Limits/Monitoring\"))),\"\")","v":""}]
[null,null,"Total Arsenic",null,null,null,null,null,null,null,null,null,null,null,null,null,null,null,null,{"$f":"IF(C18<>\"\",IF(VLOOKUP(C18,Reference!$A$3:$B$188,2,FALSE)=\"\",\"N/A\",VLOOKUP(C18,Reference!$A$3:$B$188,2,FALSE)),\"\")","v":10},null,null,null,"",null,null,null,null,null,null,null,null,{"$f":"IF($N18<>\"\",IF(AND(X18=\"Yes\",AC18<>\"\"),IF(($N18/$AC18)>=0.5,\"Establish Limits\",IF(AND($AO18=\"Y\",($N18/$AC18)>0.1),\"Monitor\",IF(AND($AO18<>\"Y\",($N18/$AC18)>0.25),\"Monitor\",\"No Limits/Monitoring\"))),\"\"),\"\")","v":""},null,null,null,null,null,null,{"$f":"IF(C18<>\"\",IF(VLOOKUP(C18,Reference!$I$3:$J$188,2,FALSE)=\" \",0,VLOOKUP(C18,Reference!$I$3:$J$188,2,FALSE)),\"\")","v":3},{"$f":"IF(C18<>\"\",IF(VLOOKUP(C18,Reference!$M$3:$Q$188,5,FALSE)=\" \",0,VLOOKUP(C18,Reference!$M$3:$Q$188,5,FALSE)),\"\")","v":"Y"},{"$f":"IF(AND(X18=\"Yes\",AC18<>\"\"),IF((N18/AC18)>=0.5,\"Establish Limits\",IF(AND(AO18=\"Y\",(N18/AC18)>0.1),\"Monitor\",IF(AND(AO18<>\"Y\",(N18/AC18)>0.25),\"Monitor\",\"No Limits/Monitoring\"))),\"\")","v":""}]
[null,null,"Total Barium",null,null,null,null,null,null,null,null,null,null,null,null,null,null,null,null,{"$f":"IF(C19<>\"\",IF(VLOOKUP(C19,Reference!$A$3:$B$188,2,FALSE)=\"\",\"N/A\",VLOOKUP(C19,Reference!$A$3:$B$188,2,FALSE)),\"\")","v":2400},null,null,null,"",null,null,null,null,null,null,null,null,{"$f":"IF($N19<>\"\",IF(AND(X19=\"Yes\",AC19<>\"\"),IF(($N19/$AC19)>=0.5,\"Establish Limits\",IF(AND($AO19=\"Y\",($N19/$AC19)>0.1),\"Monitor\",IF(AND($AO19<>\"Y\",($N19/$AC19)>0.25),\"Monitor\",\"No Limits/Monitoring\"))),\"\"),\"\")","v":""},null,null,null,null,null,null,{"$f":"IF(C19<>\"\",IF(VLOOKUP(C19,Reference!$I$3:$J$188,2,FALSE)=\" \",0,VLOOKUP(C19,Reference!$I$3:$J$188,2,FALSE)),\"\")","v":2},{"$f":"IF(C19<>\"\",IF(VLOOKUP(C19,Reference!$M$3:$Q$188,5,FALSE)=\" \",0,VLOOKUP(C19,Reference!$M$3:$Q$188,5,FALSE)),\"\")","v":"Y"},{"$f":"IF(AND(X19=\"Yes\",AC19<>\"\"),IF((N19/AC19)>=0.5,\"Establish Limits\",IF(AND(AO19=\"Y\",(N19/AC19)>0.1),\"Monitor\",IF(AND(AO19<>\"Y\",(N19/AC19)>0.25),\"Monitor\",\"No Limits/Monitoring\"))),\"\")","v":""}]
[null,null,"Total Beryllium",null,null,null,null,null,null,null,null,null,null,null,null,null,null,null,null,{"$f":"IF(C20<>\"\",IF(VLOOKUP(C20,Reference!$A$3:$B$188,2,FALSE)=\"\",\"N/A\",VLOOKUP(C20,Reference!$A$3:$B$188,2,FALSE)),\"\")","v":"N/A"},null,null,null,"",null,null,null,null,null,null,null,null,"",null,null,null,null,null,null,{"$f":"IF(C20<>\"\",IF(VLOOKUP(C20,Reference!$I$3:$J$188,2,FALSE)=\" \",0,VLOOKUP(C20,Reference!$I$3:$J$188,2,FALSE)),\"\")","v":1},{"$f":"IF(C20<>\"\",IF(VLOOKUP(C20,Reference!$M$3:$Q$188,5,FALSE)=\" \",0,VLOOKUP(C20,Reference!$M$3:$Q$188,5,FALSE)),\"\")","v":"Y"},""]
[null,null,"Total Boron",null,null,null,null,null,null,null,null,null,null,null,null,null,null,null,null,{"$f":"IF(C21<>\"\",IF(VLOOKUP(C21,Reference!$A$3:$B$188,2,FALSE)=\"\",\"N/A\",VLOOKUP(C21,Reference!$A$3:$B$188,2,FALSE)),\"\")","v":1600},null,null,null,"",null,null,null,null,null,null,null,null,"",null,null,null,null,null,null,{"$f":"IF(C21<>\"\",IF(VLOOKUP(C21,Reference!$I$3:$J$188,2,FALSE)=\" \",0,VLOOKUP(C21,Reference!$I$3:$J$188,2,FALSE)),\"\")","v":200},{"$f":"IF(C21<>\"\",IF(VLOOKUP(C21,Reference!$M$3:$Q$188,5,FALSE)=\" \",0,VLOOKUP(C21,Reference!$M$3:$Q$188,5,FALSE)),\"\")","v":"Y"},""]
[null,null,"Total Cadmium",null,null,null,null,null,null,null,null,null,null,null,null,null,null,null,null,{"$f":"IF(C22<>\"\",IF(VLOOKUP(C22,Reference!$A$3:$B$188,2,FALSE)=\"\",\"N/A\",VLOOKUP(C22,Reference!$A$3:$B$188,2,FALSE)),\"\")","v":0.27100000000000002},null,null,null,"",null,null,null,null,null,null,null,null,{"$f":"IF($N22<>\"\",IF(AND(X22=\"Yes\",AC22<>\"\"),IF(($N22/$AC22)>=0.5,\"Establish Limits\",IF(AND($AO22=\"Y\",($N22/$AC22)>0.1),\"Monitor\",IF(AND($AO22<>\"Y\",($N22/$AC22)>0.25),\"Monitor\",\"No Limits/Monitoring\"))),\"\"),\"\")","v":""},null,null,null,null,null,null,{"$f":"IF(C22<>\"\",IF(VLOOKUP(C22,Reference!$I$3:$J$188,2,FALSE)=\" \",0,VLOOKUP(C22,Reference!$I$3:$J$188,2,FALSE)),\"\")","v":0.2},{"$f":"IF(C22<>\"\",IF(VLOOKUP(C22,Reference!$M$3:$Q$188,5,FALSE)=\" \",0,VLOOKUP(C22,Reference!$M$3:$Q$188,5,FALSE)),\"\")","v":"Y"},""]
[null,null,"Total Chromium",null,null,null,null,null,null,null,null,null,null,null,null,null,null,null,null,{"$f":"IF(C23<>\"\",IF(VLOOKUP(C23,Reference!$A$3:$B$188,2,FALSE)=\"\",\"N/A\",VLOOKUP(C23,Reference!$A$3:$B$188,2,FALSE)),\"\")","v":"N/A"},null,null,null,"",null,null,null,null,null,null,null,null,"",null,null,null,null,null,null,{"$f":"IF(C23<>\"\",IF(VLOOKUP(C23,Reference!$I$3:$J$188,2,FALSE)=\" \",0,VLOOKUP(C23,Reference!$I$3:$J$188,2,FALSE)),\"\")","v":4},{"$f":"IF(C23<>\"\",IF(VLOOKUP(C23,Reference!$M$3:$Q$188,5,FALSE)=\" \",0,VLOOKUP(C23,Reference!$M$3:$Q$188,5,FALSE)),\"\")","v":"Y"},""]
[null,null,"Hexavalent Chromium",null,null,null,null,null,null,null,null,null,null,null,null,null,null,null,null,{"$f":"IF(C24<>\"\",IF(VLOOKUP(C24,Reference!$A$3:$B$188,2,FALSE)=\"\",\"N/A\",VLOOKUP(C24,Reference!$A$3:$B$188,2,FALSE)),\"\")","v":10.395010395010395},null,null,null,"",null,null,null,null,null,null,null,null,"",null,null,null,null,null,null,{"$f":"IF(C24<>\"\",IF(VLOOKUP(C24,Reference!$I$3:$J$188,2,FALSE)=\" \",0,VLOOKUP(C24,Reference!$I$3:$J$188,2,FALSE)),\"\")","v":1},{"$f":"IF(C24<>\"\",IF(VLOOKUP(C24,Reference!$M$3:$Q$188,5,FALSE)=\" \",0,VLOOKUP(C24,Reference!$M$3:$Q$188,5,FALSE)),\"\")","v":"Y"},""]
[null,null,"Total Cobalt",null,null,null,null,null,null,null,null,null,null,null,null,null,null,null,null,{"$f":"IF(C25<>\"\",IF(VLOOKUP(C25,Reference!$A$3:$B$188,2,FALSE)=\"\",\"N/A\",VLOOKUP(C25,Reference!$A$3:$B$188,2,FALSE)),\"\")","v":19},null,null,null,"",null,null,null,null,null,null,null,null,"",null,null,null,null,null,null,{"$f":"IF(C25<>\"\",IF(VLOOKUP(C25,Reference!$I$3:$J$188,2,FALSE)=\" \",0,VLOOKUP(C25,Reference!$I$3:$J$188,2,FALSE)),\"\")","v":1},{"$f":"IF(C25<>\"\",IF(VLOOKUP(C25,Reference!$M$3:$Q$188,5,FALSE)=\" \",0,VLOOKUP(C25,Reference!$M$3:$Q$188,5,FALSE)),\"\")","v":"Y"},""]
[null,null,"Total Copper",null,null,null,null,null,null,null,null,null,null,null,null,null,null,null,null,{"$f":"IF(C26<>\"\",IF(VLOOKUP(C26,Reference!$A$3:$B$188,2,FALSE)=\"\",\"N/A\",VLOOKUP(C26,Reference!$A$3:$B$188,2,FALSE)),\"\")","v":9.33},null,null,null,"",null,null,null,null,null,null,null,null,"",null,null,null,null,null,null,{"$f":"IF(C26<>\"\",IF(VLOOKUP(C26,Reference!$I$3:$J$188,2,FALSE)=\" \",0,VLOOKUP(C26,Reference!$I$3:$J$188,2,FALSE)),\"\")","v":4},{"$f":"IF(C26<>\"\",IF(VLOOKUP(C26,Reference!$M$3:$Q$188,5,FALSE)=\" \",0,VLOOKUP(C26,Reference!$M$3:$Q$188,5,FALSE)),\"\")","v":"Y"},""]
[null,null,"Free Available Cyanide",null,null,null,null,null,null,null,null,null,null,null,null,null,null,null,null,{"$f":"IF(C27<>\"\",IF(VLOOKUP(C27,Reference!$A$3:$B$188,2,FALSE)=\"\",\"N/A\",VLOOKUP(C27,Reference!$A$3:$B$188,2,FALSE)),\"\")","v":5.2},null,null,null,{"$f":"IF(AND(C27<>\"\",N27<>\"\",$J$8<>\"\",$Z$7<>\"\"),IF(T27<>\"N/A\",IF(AND(N27<=VALUE(AN27),M27=\"<\"),\"No (Value < QL)\",IF($AP$9=\"No\",IF(N27>=(0.5*T27),IF(AND(M27=\"<\",N27=(0.5*T27)),\"No\",\"Yes\"),\"No\"),IF(N27>=T27,IF(AND(M27=\"<\",N27=T27),\"No\",\"Yes\"),\"No\"))),\"No\"),\"\")","v":""},null,null,null,null,null,null,null,null,"",null,null,null,null,null,null,{"$f":"IF(C27<>\"\",IF(VLOOKUP(C27,Reference!$I$3:$J$188,2,FALSE)=\" \",0,VLOOKUP(C27,Reference!$I$3:$J$188,2,FALSE)),\"\")","v":1},{"$f":"IF(C27<>\"\",IF(VLOOKUP(C27,Reference!$M$3:$Q$188,5,FALSE)=\" \",0,VLOOKUP(C27,Reference!$M$3:$Q$188,5,FALSE)),\"\")","v":0},""]
[null,null,"Total Cyanide",null,null,null,null,null,null,null,null,null,null,null,null,null,null,null,null,{"$f":"IF(C28<>\"\",IF(VLOOKUP(C28,Reference!$A$3:$B$188,2,FALSE)=\"\",\"N/A\",VLOOKUP(C28,Reference!$A$3:$B$188,2,FALSE)),\"\")","v":"N/A"},null,null,null,"",null,null,null,null,null,null,null,null,"",null,null,null,null,null,null,{"$f":"IF(C28<>\"\",IF(VLOOKUP(C28,Reference!$I$3:$J$188,2,FALSE)=\" \",0,VLOOKUP(C28,Reference!$I$3:$J$188,2,FALSE)),\"\")","v":10},{"$f":"IF(C28<>\"\",IF(VLOOKUP(C28,Reference!$M$3:$Q$188,5,FALSE)=\" \",0,VLOOKUP(C28,Reference!$M$3:$Q$188,5,FALSE)),\"\")","v":0},""]
[null,null,"Dissolved Iron",null,null,null,null,null,null,null,null,null,null,null,null,null,null,null,null,{"$f":"IF(C29<>\"\",IF(VLOOKUP(C29,Reference!$A$3:$B$188,2,FALSE)=\"\",\"N/A\",VLOOKUP(C29,Reference!$A$3:$B$188,2,FALSE)),\"\")","v":300},null,null,null,"",null,null,null,null,null,null,null,null,"",null,null,null,null,null,null,{"$f":"IF(C29<>\"\",IF(VLOOKUP(C29,Reference!$I$3:$J$188,2,FALSE)=\" \",0,VLOOKUP(C29,Reference!$I$3:$J$188,2,FALSE)),\"\")","v":20},{"$f":"IF(C29<>\"\",IF(VLOOKUP(C29,Reference!$M$3:$Q$188,5,FALSE)=\" \",0,VLOOKUP(C29,Reference!$M$3:$Q$188,5,FALSE)),\"\")","v":"Y"},""]
[null,null,"Total Iron",null,null,null,null,null,null,null,null,null,null,null,null,null,null,null,null,{"$f":"IF(C30<>\"\",IF(VLOOKUP(C30,Reference!$A$3:$B$188,2,FALSE)=\"\",\"N/A\",VLOOKUP(C30,Reference!$A$3:$B$188,2,FALSE)),\"\")","v":1500},null,null,null,"",null,null,null,null,null,null,null,null,"",null,null,null,null,null,null,{"$f":"IF(C30<>\"\",IF(VLOOKUP(C30,Reference!$I$3:$J$188,2,FALSE)=\" \",0,VLOOKUP(C30,Reference!$I$3:$J$188,2,FALSE)),\"\")","v":20},{"$f":"IF(C30<>\"\",IF(VLOOKUP(C30,Reference!$M$3:$Q$188,5,FALSE)=\" \",0,VLOOKUP(C30,Reference!$M$3:$Q$188,5,FALSE)),\"\")","v":"Y"},""]
[null,null,"Total Lead",null,null,null,null,null,null,null,null,null,null,null,null,null,null,null,null,{"$f":"IF(C31<>\"\",IF(VLOOKUP(C31,Reference!$A$3:$B$188,2,FALSE)=\"\",\"N/A\",VLOOKUP(C31,Reference!$A$3:$B$188,2,FALSE)),\"\")","v":3.18},null,null,null,"",null,null,null,null,null,null,null,null,"",null,null,null,null,null,null,{"$f":"IF(C31<>\"\",IF(VLOOKUP(C31,Reference!$I$3:$J$188,2,FALSE)=\" \",0,VLOOKUP(C31,Reference!$I$3:$J$188,2,FALSE)),\"\")","v":1},{"$f":"IF(C31<>\"\",IF(VLOOKUP(C31,Reference!$M$3:$Q$188,5,FALSE)=\" \",0,VLOOKUP(C31,Reference!$M$3:$Q$188,5,FALSE)),\"\")","v":"Y"},""]
[null,null,"Total Manganese",null,null,null,null,null,null,null,null,null,null,null,null,null,null,null,null,{"$f":"IF(C32<>\"\",IF(VLOOKUP(C32,Reference!$A$3:$B$188,2,FALSE)=\"\",\"N/A\",VLOOKUP(C32,Reference!$A$3:$B$188,2,FALSE)),\"\")","v":1000},null,null,null,"",null,null,null,null,null,null,null,null,"",null,null,null,null,null,null,{"$f":"IF(C32<>\"\",IF(VLOOKUP(C32,Reference!$I$3:$J$188,2,FALSE)=\" \",0,VLOOKUP(C32,Reference!$I$3:$J$188,2,FALSE)),\"\")","v":2},{"$f":"IF(C32<>\"\",IF(VLOOKUP(C32,Reference!$M$3:$Q$188,5,FALSE)=\" \",0,VLOOKUP(C32,Reference!$M$3:$Q$188,5,FALSE)),\"\")","v":"Y"},""]
[null,null,"Total Mercury",null,null,null,null,null,null,null,null,null,null,null,null,null,null,null,null,{"$f":"IF(C33<>\"\",IF(VLOOKUP(C33,Reference!$A$3:$B$188,2,FALSE)=\"\",\"N/A\",VLOOKUP(C33,Reference!$A$3:$B$188,2,FALSE)),\"\")","v":0.05},null,null,null,"",null,null,null,null,null,null,null,null,"",null,null,null,null,null,null,{"$f":"IF(C33<>\"\",IF(VLOOKUP(C33,Reference!$I$3:$J$188,2,FALSE)=\" \",0,VLOOKUP(C33,Reference!$I$3:$J$188,2,FALSE)),\"\")","v":0.2},{"$f":"IF(C33<>\"\",IF(VLOOKUP(C33,Reference!$M$3:$Q$188,5,FALSE)=\" \",0,VLOOKUP(C33,Reference!$M$3:$Q$188,5,FALSE)),\"\")","v":"Y"},""]
[null,null,"Total Nickel",null,null,null,null,null,null,null,null,null,null,null,null,null,null,null,null,{"$f":"IF(C34<>\"\",IF(VLOOKUP(C34,Reference!$A$3:$B$188,2,FALSE)=\"\",\"N/A\",VLOOKUP(C34,Reference!$A$3:$B$188,2,FALSE)),\"\")","v":52.2},null,null,null,"",null,null,null,null,null,null,null,null,"",null,null,null,null,null,null,{"$f":"IF(C34<>\"\",IF(VLOOKUP(C34,Reference!$I$3:$J$188,2,FALSE)=\" \",0,VLOOKUP(C34,Reference!$I$3:$J$188,2,FALSE)),\"\")","v":4},{"$f":"IF(C34<>\"\",IF(VLOOKUP(C34,Reference!$M$3:$Q$188,5,FALSE)=\" \",0,VLOOKUP(C34,Reference!$M$3:$Q$188,5,FALSE)),\"\")","v":"Y"},""]
[null,null,"Total Phenols (Phenolics)",null,null,null,null,null,null,null,null,null,null,null,null,null,null,null,null,{"$f":"IF(C35<>\"\",IF(VLOOKUP(C35,Reference!$A$3:$B$188,2,FALSE)=\"\",\"N/A\",VLOOKUP(C35,Reference!$A$3:$B$188,2,FALSE)),\"\")","v":5},null,null,null,"",null,null,null,null,null,null,null,null,"",null,null,null,null,null,null,5,{"$f":"IF(C35<>\"\",IF(VLOOKUP(C35,Reference!$M$3:$Q$188,5,FALSE)=\" \",0,VLOOKUP(C35,Reference!$M$3:$Q$188,5,FALSE)),\"\")","v":0},""]
[null,null,"Total Selenium",null,null,null,null,null,null,null,null,null,null,null,null,null,null,null,null,{"$f":"IF(C36<>\"\",IF(VLOOKUP(C36,Reference!$A$3:$B$188,2,FALSE)=\"\",\"N/A\",VLOOKUP(C36,Reference!$A$3:$B$188,2,FALSE)),\"\")","v":4.9891540130151837},null,null,null,"",null,null,null,null,null,null,null,null,"",null,null,null,null,null,null,{"$f":"IF(C36<>\"\",IF(VLOOKUP(C36,Reference!$I$3:$J$188,2,FALSE)=\" \",0,VLOOKUP(C36,Reference!$I$3:$J$188,2,FALSE)),\"\")","v":5},{"$f":"IF(C36<>\"\",IF(VLOOKUP(C36,Reference!$M$3:$Q$188,5,FALSE)=\" \",0,VLOOKUP(C36,Reference!$M$3:$Q$188,5,FALSE)),\"\")","v":"Y"},""]
[null,null,"Total Silver",null,null,null,null,null,null,null,null,null,null,null,null,null,null,null,null,{"$f":"IF(C37<>\"\",IF(VLOOKUP(C37,Reference!$A$3:$B$188,2,FALSE)=\"\",\"N/A\",VLOOKUP(C37,Reference!$A$3:$B$188,2,FALSE)),\"\")","v":3.78},null,null,null,"",null,null,null,null,null,null,null,null,"",null,null,null,null,null,null,{"$f":"IF(C37<>\"\",IF(VLOOKUP(C37,Reference!$I$3:$J$188,2,FALSE)=\" \",0,VLOOKUP(C37,Reference!$I$3:$J$188,2,FALSE)),\"\")","v":0.4},{"$f":"IF(C37<>\"\",IF(VLOOKUP(C37,Reference!$M$3:$Q$188,5,FALSE)=\" \",0,VLOOKUP(C37,Reference!$M$3:$Q$188,5,FALSE)),\"\")","v":"Y"},""]
[null,null,"Total Thallium",null,null,null,null,null,null,null,null,null,null,null,null,null,null,null,null,{"$f":"IF(C38<>\"\",IF(VLOOKUP(C38,Reference!$A$3:$B$188,2,FALSE)=\"\",\"N/A\",VLOOKUP(C38,Reference!$A$3:$B$188,2,FALSE)),\"\")","v":0.24000000000000002},null,null,null,"",null,null,null,null,null,null,null,null,"",null,null,null,null,null,null,{"$f":"IF(C38<>\"\",IF(VLOOKUP(C38,Reference!$I$3:$J$188,2,FALSE)=\" \",0,VLOOKUP(C38,Reference!$I$3:$J$188,2,FALSE)),\"\")","v":2},{"$f":"IF(C38<>\"\",IF(VLOOKUP(C38,Reference!$M$3:$Q$188,5,FALSE)=\" \",0,VLOOKUP(C38,Reference!$M$3:$Q$188,5,FALSE)),\"\")","v":"Y"},""]
[null,null,"Total Zinc",null,null,null,null,null,null,null,null,null,null,null,null,null,null,null,null,{"$f":"IF(C39<>\"\",IF(VLOOKUP(C39,Reference!$A$3:$B$188,2,FALSE)=\"\",\"N/A\",VLOOKUP(C39,Reference!$A$3:$B$188,2,FALSE)),\"\")","v":119.8},null,null,null,"",null,null,null,null,null,null,null,null,"",null,null,null,null,null,null,{"$f":"IF(C39<>\"\",IF(VLOOKUP(C39,Reference!$I$3:$J$188,2,FALSE)=\" \",0,VLOOKUP(C39,Reference!$I$3:$J$188,2,FALSE)),\"\")","v":5},{"$f":"IF(C39<>\"\",IF(VLOOKUP(C39,Reference!$M$3:$Q$188,5,FALSE)=\" \",0,VLOOKUP(C39,Reference!$M$3:$Q$188,5,FALSE)),\"\")","v":"Y"},""]
[null,null,"Total Molybdenum",null,null,null,null,null,null,null,null,null,null,null,null,null,null,null,null,{"$f":"IF(C40<>\"\",IF(VLOOKUP(C40,Reference!$A$3:$B$188,2,FALSE)=\"\",\"N/A\",VLOOKUP(C40,Reference!$A$3:$B$188,2,FALSE)),\"\")","v":"N/A"},null,null,null,"",null,null,null,null,null,null,null,null,"",null,null,null,null,null,null,{"$f":"IF(C40<>\"\",IF(VLOOKUP(C40,Reference!$I$3:$J$188,2,FALSE)=\" \",0,VLOOKUP(C40,Reference!$I$3:$J$188,2,FALSE)),\"\")","v":4},{"$f":"IF(C40<>\"\",IF(VLOOKUP(C40,Reference!$M$3:$Q$188,5,FALSE)=\" \",0,VLOOKUP(C40,Reference!$M$3:$Q$188,5,FALSE)),\"\")","v":"Y"},""]
[null,"Group 3","Acrolein",null,null,null,null,null,null,null,null,null,"<",null,null,null,null,null,null,{"$f":"IF(C41<>\"\",IF(VLOOKUP(C41,Reference!$A$3:$B$188,2,FALSE)=\"\",\"N/A\",VLOOKUP(C41,Reference!$A$3:$B$188,2,FALSE)),\"\")","v":3},null,null,null,"",null,null,null,null,null,null,null,null,"",null,null,null,null,null,null,{"$f":"IF(C41<>\"\",IF(VLOOKUP(C41,Reference!$I$3:$J$188,2,FALSE)=\" \",0,VLOOKUP(C41,Reference!$I$3:$J$188,2,FALSE)),\"\")","v":2},{"$f":"IF(C41<>\"\",IF(VLOOKUP(C41,Reference!$M$3:$Q$188,5,FALSE)=\" \",0,VLOOKUP(C41,Reference!$M$3:$Q$188,5,FALSE)),\"\")","v":0},""]
[null,null,"Acrylonitrile",null,null,null,null,null,null,null,null,null,"<",null,null,null,null,null,null,{"$f":"IF(C42<>\"\",IF(VLOOKUP(C42,Reference!$A$3:$B$188,2,FALSE)=\"\",\"N/A\",VLOOKUP(C42,Reference!$A$3:$B$188,2,FALSE)),\"\")","v":5.0999999999999997E-2},null,null,null,"",null,null,null,null,null,null,null,null,"",null,null,null,null,null,null,{"$f":"IF(C42<>\"\",IF(VLOOKUP(C42,Reference!$I$3:$J$188,2,FALSE)=\" \",0,VLOOKUP(C42,Reference!$I$3:$J$188,2,FALSE)),\"\")","v":5},{"$f":"IF(C42<>\"\",IF(VLOOKUP(C42,Reference!$M$3:$Q$188,5,FALSE)=\" \",0,VLOOKUP(C42,Reference!$M$3:$Q$188,5,FALSE)),\"\")","v":0},""]
[null,null,"Benzene",null,null,null,null,null,null,null,null,null,"<",null,null,null,null,null,null,{"$f":"IF(C43<>\"\",IF(VLOOKUP(C43,Reference!$A$3:$B$188,2,FALSE)=\"\",\"N/A\",VLOOKUP(C43,Reference!$A$3:$B$188,2,FALSE)),\"\")","v":1.2},null,null,null,"",null,null,null,null,null,null,null,null,"",null,null,null,null,null,null,{"$f":"IF(C43<>\"\",IF(VLOOKUP(C43,Reference!$I$3:$J$188,2,FALSE)=\" \",0,VLOOKUP(C43,Reference!$I$3:$J$188,2,FALSE)),\"\")","v":0.5},{"$f":"IF(C43<>\"\",IF(VLOOKUP(C43,Reference!$M$3:$Q$188,5,FALSE)=\" \",0,VLOOKUP(C43,Reference!$M$3:$Q$188,5,FALSE)),\"\")","v":0},""]
[null,null,"Bromoform",null,null,null,null,null,null,null,null,null,"<",null,null,null,null,null,null,{"$f":"IF(C44<>\"\",IF(VLOOKUP(C44,Reference!$A$3:$B$188,2,FALSE)=\"\",\"N/A\",VLOOKUP(C44,Reference!$A$3:$B$188,2,FALSE)),\"\")","v":4.3},null,null,null,"",null,null,null,null,null,null,null,null,"",null,null,null,null,null,null,{"$f":"IF(C44<>\"\",IF(VLOOKUP(C44,Reference!$I$3:$J$188,2,FALSE)=\" \",0,VLOOKUP(C44,Reference!$I$3:$J$188,2,FALSE)),\"\")","v":0.5},{"$f":"IF(C44<>\"\",IF(VLOOKUP(C44,Reference!$M$3:$Q$188,5,FALSE)=\" \",0,VLOOKUP(C44,Reference!$M$3:$Q$188,5,FALSE)),\"\")","v":0},""]
[null,null,"Carbon Tetrachloride",null,null,null,null,null,null,null,null,null,"<",null,null,null,null,null,null,{"$f":"IF(C45<>\"\",IF(VLOOKUP(C45,Reference!$A$3:$B$188,2,FALSE)=\"\",\"N/A\",VLOOKUP(C45,Reference!$A$3:$B$188,2,FALSE)),\"\")","v":0.23},null,null,null,"",null,null,null,null,null,null,null,null,"",null,null,null,null,null,null,{"$f":"IF(C45<>\"\",IF(VLOOKUP(C45,Reference!$I$3:$J$188,2,FALSE)=\" \",0,VLOOKUP(C45,Reference!$I$3:$J$188,2,FALSE)),\"\")","v":0.5},{"$f":"IF(C45<>\"\",IF(VLOOKUP(C45,Reference!$M$3:$Q$188,5,FALSE)=\" \",0,VLOOKUP(C45,Reference!$M$3:$Q$188,5,FALSE)),\"\")","v":0},""]
[null,null,"Chlorobenzene",null,null,null,null,null,null,null,null,null,"<",null,null,null,null,null,null,{"$f":"IF(C46<>\"\",IF(VLOOKUP(C46,Reference!$A$3:$B$188,2,FALSE)=\"\",\"N/A\",VLOOKUP(C46,Reference!$A$3:$B$188,2,FALSE)),\"\")","v":130},null,null,null,"",null,null,null,null,null,null,null,null,"",null,null,null,null,null,null,{"$f":"IF(C46<>\"\",IF(VLOOKUP(C46,Reference!$I$3:$J$188,2,FALSE)=\" \",0,VLOOKUP(C46,Reference!$I$3:$J$188,2,FALSE)),\"\")","v":0.5},{"$f":"IF(C46<>\"\",IF(VLOOKUP(C46,Reference!$M$3:$Q$188,5,FALSE)=\" \",0,VLOOKUP(C46,Reference!$M$3:$Q$188,5,FALSE)),\"\")","v":0},""]
[null,null,"Chlorodibromomethane",null,null,null,null,null,null,null,null,null,"<",null,null,null,null,null,null,{"$f":"IF(C47<>\"\",IF(VLOOKUP(C47,Reference!$A$3:$B$188,2,FALSE)=\"\",\"N/A\",VLOOKUP(C47,Reference!$A$3:$B$188,2,FALSE)),\"\")","v":0.4},null,null,null,"",null,null,null,null,null,null,null,null,"",null,null,null,null,null,null,{"$f":"IF(C47<>\"\",IF(VLOOKUP(C47,Reference!$I$3:$J$188,2,FALSE)=\" \",0,VLOOKUP(C47,Reference!$I$3:$J$188,2,FALSE)),\"\")","v":0.5},{"$f":"IF(C47<>\"\",IF(VLOOKUP(C47,Reference!$M$3:$Q$188,5,FALSE)=\" \",0,VLOOKUP(C47,Reference!$M$3:$Q$188,5,FALSE)),\"\")","v":0},""]
[null,null,"Chloroethane",null,null,null,null,null,null,null,null,null,"<",null,null,null,null,null,null,{"$f":"IF(C48<>\"\",IF(VLOOKUP(C48,Reference!$A$3:$B$188,2,FALSE)=\"\",\"N/A\",VLOOKUP(C48,Reference!$A$3:$B$188,2,FALSE)),\"\")","v":"N/A"},null,null,null,"",null,null,null,null,null,null,null,null,"",null,null,null,null,null,null,{"$f":"IF(C48<>\"\",IF(VLOOKUP(C48,Reference!$I$3:$J$188,2,FALSE)=\" \",0,VLOOKUP(C48,Reference!$I$3:$J$188,2,FALSE)),\"\")","v":0.5},{"$f":"IF(C48<>\"\",IF(VLOOKUP(C48,Reference!$M$3:$Q$188,5,FALSE)=\" \",0,VLOOKUP(C48,Reference!$M$3:$Q$188,5,FALSE)),\"\")","v":0},""]
[null,null,"2-Chloroethyl Vinyl Ether",null,null,null,null,null,null,null,null,null,"<",null,null,null,null,null,null,{"$f":"IF(C49<>\"\",IF(VLOOKUP(C49,Reference!$A$3:$B$188,2,FALSE)=\"\",\"N/A\",VLOOKUP(C49,Reference!$A$3:$B$188,2,FALSE)),\"\")","v":3500},null,null,null,"",null,null,null,null,null,null,null,null,"",null,null,null,null,null,null,{"$f":"IF(C49<>\"\",IF(VLOOKUP(C49,Reference!$I$3:$J$188,2,FALSE)=\" \",0,VLOOKUP(C49,Reference!$I$3:$J$188,2,FALSE)),\"\")","v":5},{"$f":"IF(C49<>\"\",IF(VLOOKUP(C49,Reference!$M$3:$Q$188,5,FALSE)=\" \",0,VLOOKUP(C49,Reference!$M$3:$Q$188,5,FALSE)),\"\")","v":0},""]
[null,null,"Chloroform",null,null,null,null,null,null,null,null,null,"<",null,null,null,null,null,null,{"$f":"IF(C50<>\"\",IF(VLOOKUP(C50,Reference!$A$3:$B$188,2,FALSE)=\"\",\"N/A\",VLOOKUP(C50,Reference!$A$3:$B$188,2,FALSE)),\"\")","v":5.7},null,null,null,"",null,null,null,null,null,null,null,null,"",null,null,null,null,null,null,{"$f":"IF(C50<>\"\",IF(VLOOKUP(C50,Reference!$I$3:$J$188,2,FALSE)=\" \",0,VLOOKUP(C50,Reference!$I$3:$J$188,2,FALSE)),\"\")","v":0.5},{"$f":"IF(C50<>\"\",IF(VLOOKUP(C50,Reference!$M$3:$Q$188,5,FALSE)=\" \",0,VLOOKUP(C50,Reference!$M$3:$Q$188,5,FALSE)),\"\")","v":0},""]
[null,null,"Dichlorobromomethane",null,null,null,null,null,null,null,null,null,"<",null,null,null,null,null,null,{"$f":"IF(C51<>\"\",IF(VLOOKUP(C51,Reference!$A$3:$B$188,2,FALSE)=\"\",\"N/A\",VLOOKUP(C51,Reference!$A$3:$B$188,2,FALSE)),\"\")","v":0.55000000000000004},null,null,null,"",null,null,null,null,null,null,null,null,"",null,null,null,null,null,null,{"$f":"IF(C51<>\"\",IF(VLOOKUP(C51,Reference!$I$3:$J$188,2,FALSE)=\" \",0,VLOOKUP(C51,Reference!$I$3:$J$188,2,FALSE)),\"\")","v":0.5},{"$f":"IF(C51<>\"\",IF(VLOOKUP(C51,Reference!$M$3:$Q$188,5,FALSE)=\" \",0,VLOOKUP(C51,Reference!$M$3:$Q$188,5,FALSE)),\"\")","v":0},""]
[null,null,"1,1-Dichloroethane",null,null,null,null,null,null,null,null,null,"<",null,null,null,null,null,null,{"$f":"IF(C52<>\"\",IF(VLOOKUP(C52,Reference!$A$3:$B$188,2,FALSE)=\"\",\"N/A\",VLOOKUP(C52,Reference!$A$3:$B$188,2,FALSE)),\"\")","v":"N/A"},null,null,null,"",null,null,null,null,null,null,null,null,"",null,null,null,null,null,null,{"$f":"IF(C52<>\"\",IF(VLOOKUP(C52,Reference!$I$3:$J$188,2,FALSE)=\" \",0,VLOOKUP(C52,Reference!$I$3:$J$188,2,FALSE)),\"\")","v":0.5},{"$f":"IF(C52<>\"\",IF(VLOOKUP(C52,Reference!$M$3:$Q$188,5,FALSE)=\" \",0,VLOOKUP(C52,Reference!$M$3:$Q$188,5,FALSE)),\"\")","v":0},""]
[null,null,"1,2-Dichloroethane",null,null,null,null,null,null,null,null,null,"<",null,null,null,null,null,null,{"$f":"IF(C53<>\"\",IF(VLOOKUP(C53,Reference!$A$3:$B$188,2,FALSE)=\"\",\"N/A\",VLOOKUP(C53,Reference!$A$3:$B$188,2,FALSE)),\"\")","v":0.38},null,null,null,"",null,null,null,null,null,null,null,null,"",null,null,null,null,null,null,{"$f":"IF(C53<>\"\",IF(VLOOKUP(C53,Reference!$I$3:$J$188,2,FALSE)=\" \",0,VLOOKUP(C53,Reference!$I$3:$J$188,2,FALSE)),\"\")","v":0.5},{"$f":"IF(C53<>\"\",IF(VLOOKUP(C53,Reference!$M$3:$Q$188,5,FALSE)=\" \",0,VLOOKUP(C53,Reference!$M$3:$Q$188,5,FALSE)),\"\")","v":0},""]
[null,null,"1,1-Dichloroethylene",null,null,null,null,null,null,null,null,null,"<",null,null,null,null,null,null,{"$f":"IF(C54<>\"\",IF(VLOOKUP(C54,Reference!$A$3:$B$188,2,FALSE)=\"\",\"N/A\",VLOOKUP(C54,Reference!$A$3:$B$188,2,FALSE)),\"\")","v":33},null,null,null,"",null,null,null,null,null,null,null,null,"",null,null,null,null,null,null,{"$f":"IF(C54<>\"\",IF(VLOOKUP(C54,Reference!$I$3:$J$188,2,FALSE)=\" \",0,VLOOKUP(C54,Reference!$I$3:$J$188,2,FALSE)),\"\")","v":0.5},{"$f":"IF(C54<>\"\",IF(VLOOKUP(C54,Reference!$M$3:$Q$188,5,FALSE)=\" \",0,VLOOKUP(C54,Reference!$M$3:$Q$188,5,FALSE)),\"\")","v":0},""]
[null,null,"1,2-Dichloropropane",null,null,null,null,null,null,null,null,null,"<",null,null,null,null,null,null,{"$f":"IF(C55<>\"\",IF(VLOOKUP(C55,Reference!$A$3:$B$188,2,FALSE)=\"\",\"N/A\",VLOOKUP(C55,Reference!$A$3:$B$188,2,FALSE)),\"\")","v":2200},null,null,null,"",null,null,null,null,null,null,null,null,"",null,null,null,null,null,null,{"$f":"IF(C55<>\"\",IF(VLOOKUP(C55,Reference!$I$3:$J$188,2,FALSE)=\" \",0,VLOOKUP(C55,Reference!$I$3:$J$188,2,FALSE)),\"\")","v":0.5},{"$f":"IF(C55<>\"\",IF(VLOOKUP(C55,Reference!$M$3:$Q$188,5,FALSE)=\" \",0,VLOOKUP(C55,Reference!$M$3:$Q$188,5,FALSE)),\"\")","v":0},""]
[null,null,"1,3-Dichloropropylene",null,null,null,null,null,null,null,null,null,"<",null,null,null,null,null,null,{"$f":"IF(C56<>\"\",IF(VLOOKUP(C56,Reference!$A$3:$B$188,2,FALSE)=\"\",\"N/A\",VLOOKUP(C56,Reference!$A$3:$B$188,2,FALSE)),\"\")","v":0.34},null,null,null,"",null,null,null,null,null,null,null,null,"",null,null,null,null,null,null,{"$f":"IF(C56<>\"\",IF(VLOOKUP(C56,Reference!$I$3:$J$188,2,FALSE)=\" \",0,VLOOKUP(C56,Reference!$I$3:$J$188,2,FALSE)),\"\")","v":0.5},{"$f":"IF(C56<>\"\",IF(VLOOKUP(C56,Reference!$M$3:$Q$188,5,FALSE)=\" \",0,VLOOKUP(C56,Reference!$M$3:$Q$188,5,FALSE)),\"\")","v":0},""]
[null,null,"1,4-Dioxane",null,null,null,null,null,null,null,null,null,"<",null,null,null,null,null,null,{"$f":"IF(C57<>\"\",IF(VLOOKUP(C57,Reference!$A$3:$B$188,2,FALSE)=\"\",\"N/A\",VLOOKUP(C57,Reference!$A$3:$B$188,2,FALSE)),\"\")","v":"N/A"},null,null,null,"",null,null,null,null,null,null,null,null,"",null,null,null,null,null,null,{"$f":"IF(C57<>\"\",IF(VLOOKUP(C57,Reference!$I$3:$J$188,2,FALSE)=\" \",0,VLOOKUP(C57,Reference!$I$3:$J$188,2,FALSE)),\"\")","v":1},{"$f":"IF(C57<>\"\",IF(VLOOKUP(C57,Reference!$M$3:$Q$188,5,FALSE)=\" \",0,VLOOKUP(C57,Reference!$M$3:$Q$188,5,FALSE)),\"\")","v":0},"",10,100,{"$f":"IF(AND($Z$7<>\"\",N57<>\"\"),IF(OR(AND($Z$7>0.1,N57>AQ57),(AND($Z$7<=0.1,N57>AR57))),\"Monitor\",\"\"),\"\")","v":""},{"$f":"IF(OR(AP57=\"Establish Limits\",AP57=\"Monitor\"),AP57,IF(AND(AP57=\"No Limits/Monitoring\",AS57=\"Monitor\"),AS57,IF(AND(AP57=\"\",AS57=\"\"),\"\",IF(AND(AP57=\"\",AS57=\"Monitor\"),\"Monitor\",IF(AND(AP57=\"\",AS57=\"\"),\"Monitor\",\"\")))))","v":""}]
[null,null,"Ethylbenzene",null,null,null,null,null,null,null,null,null,"<",null,null,null,null,null,null,{"$f":"IF(C58<>\"\",IF(VLOOKUP(C58,Reference!$A$3:$B$188,2,FALSE)=\"\",\"N/A\",VLOOKUP(C58,Reference!$A$3:$B$188,2,FALSE)),\"\")","v":530},null,null,null,"",null,null,null,null,null,null,null,null,"",null,null,null,null,null,null,{"$f":"IF(C58<>\"\",IF(VLOOKUP(C58,Reference!$I$3:$J$188,2,FALSE)=\" \",0,VLOOKUP(C58,Reference!$I$3:$J$188,2,FALSE)),\"\")","v":0.5},{"$f":"IF(C58<>\"\",IF(VLOOKUP(C58,Reference!$M$3:$Q$188,5,FALSE)=\" \",0,VLOOKUP(C58,Reference!$M$3:$Q$188,5,FALSE)),\"\")","v":0},""]
[null,null,"Methyl Bromide",null,null,null,null,null,null,null,null,null,"<",null,null,null,null,null,null,{"$f":"IF(C59<>\"\",IF(VLOOKUP(C59,Reference!$A$3:$B$188,2,FALSE)=\"\",\"N/A\",VLOOKUP(C59,Reference!$A$3:$B$188,2,FALSE)),\"\")","v":47},null,null,null,"",null,null,null,null,null,null,null,null,"",null,null,null,null,null,null,{"$f":"IF(C59<>\"\",IF(VLOOKUP(C59,Reference!$I$3:$J$188,2,FALSE)=\" \",0,VLOOKUP(C59,Reference!$I$3:$J$188,2,FALSE)),\"\")","v":0.5},{"$f":"IF(C59<>\"\",IF(VLOOKUP(C59,Reference!$M$3:$Q$188,5,FALSE)=\" \",0,VLOOKUP(C59,Reference!$M$3:$Q$188,5,FALSE)),\"\")","v":0},""]
[null,null,"Methyl Chloride",null,null,null,null,null,null,null,null,null,"<",null,null,null,null,null,null,{"$f":"IF(C60<>\"\",IF(VLOOKUP(C60,Reference!$A$3:$B$188,2,FALSE)=\"\",\"N/A\",VLOOKUP(C60,Reference!$A$3:$B$188,2,FALSE)),\"\")","v":5500},null,null,null,"",null,null,null,null,null,null,null,null,"",null,null,null,null,null,null,{"$f":"IF(C60<>\"\",IF(VLOOKUP(C60,Reference!$I$3:$J$188,2,FALSE)=\" \",0,VLOOKUP(C60,Reference!$I$3:$J$188,2,FALSE)),\"\")","v":0.5},{"$f":"IF(C60<>\"\",IF(VLOOKUP(C60,Reference!$M$3:$Q$188,5,FALSE)=\" \",0,VLOOKUP(C60,Reference!$M$3:$Q$188,5,FALSE)),\"\")","v":0},""]
[null,null,"Methylene Chloride",null,null,null,null,null,null,null,null,null,"<",null,null,null,null,null,null,{"$f":"IF(C61<>\"\",IF(VLOOKUP(C61,Reference!$A$3:$B$188,2,FALSE)=\"\",\"N/A\",VLOOKUP(C61,Reference!$A$3:$B$188,2,FALSE)),\"\")","v":4.5999999999999996},null,null,null,"",null,null,null,null,null,null,null,null,"",null,null,null,null,null,null,{"$f":"IF(C61<>\"\",IF(VLOOKUP(C61,Reference!$I$3:$J$188,2,FALSE)=\" \",0,VLOOKUP(C61,Reference!$I$3:$J$188,2,FALSE)),\"\")","v":0.5},{"$f":"IF(C61<>\"\",IF(VLOOKUP(C61,Reference!$M$3:$Q$188,5,FALSE)=\" \",0,VLOOKUP(C61,Reference!$M$3:$Q$188,5,FALSE)),\"\")","v":0},""]
[null,null,"1,1,2,2-Tetrachloroethane",null,null,null,null,null,null,null,null,null,"<",null,null,null,null,null,null,{"$f":"IF(C62<>\"\",IF(VLOOKUP(C62,Reference!$A$3:$B$188,2,FALSE)=\"\",\"N/A\",VLOOKUP(C62,Reference!$A$3:$B$188,2,FALSE)),\"\")","v":0.17},null,null,null,"",null,null,null,null,null,null,null,null,"",null,null,null,null,null,null,{"$f":"IF(C62<>\"\",IF(VLOOKUP(C62,Reference!$I$3:$J$188,2,FALSE)=\" \",0,VLOOKUP(C62,Reference!$I$3:$J$188,2,FALSE)),\"\")","v":0.5},{"$f":"IF(C62<>\"\",IF(VLOOKUP(C62,Reference!$M$3:$Q$188,5,FALSE)=\" \",0,VLOOKUP(C62,Reference!$M$3:$Q$188,5,FALSE)),\"\")","v":0},""]
[null,null,"Tetrachloroethylene",null,null,null,null,null,null,null,null,null,"<",null,null,null,null,null,null,{"$f":"IF(C63<>\"\",IF(VLOOKUP(C63,Reference!$A$3:$B$188,2,FALSE)=\"\",\"N/A\",VLOOKUP(C63,Reference!$A$3:$B$188,2,FALSE)),\"\")","v":0.69},null,null,null,"",null,null,null,null,null,null,null,null,"",null,null,null,null,null,null,{"$f":"IF(C63<>\"\",IF(VLOOKUP(C63,Reference!$I$3:$J$188,2,FALSE)=\" \",0,VLOOKUP(C63,Reference!$I$3:$J$188,2,FALSE)),\"\")","v":0.5},{"$f":"IF(C63<>\"\",IF(VLOOKUP(C63,Reference!$M$3:$Q$188,5,FALSE)=\" \",0,VLOOKUP(C63,Reference!$M$3:$Q$188,5,FALSE)),\"\")","v":0},""]
[null,null,"Toluene",null,null,null,null,null,null,null,null,null,"<",null,null,null,null,null,null,{"$f":"IF(C64<>\"\",IF(VLOOKUP(C64,Reference!$A$3:$B$188,2,FALSE)=\"\",\"N/A\",VLOOKUP(C64,Reference!$A$3:$B$188,2,FALSE)),\"\")","v":330},null,null,null,"",null,null,null,null,null,null,null,null,"",null,null,null,null,null,null,{"$f":"IF(C64<>\"\",IF(VLOOKUP(C64,Reference!$I$3:$J$188,2,FALSE)=\" \",0,VLOOKUP(C64,Reference!$I$3:$J$188,2,FALSE)),\"\")","v":0.5},{"$f":"IF(C64<>\"\",IF(VLOOKUP(C64,Reference!$M$3:$Q$188,5,FALSE)=\" \",0,VLOOKUP(C64,Reference!$M$3:$Q$188,5,FALSE)),\"\")","v":0},""]
[null,null,"1,2-trans-Dichloroethylene",null,null,null,null,null,null,null,null,null,"<",null,null,null,null,null,null,{"$f":"IF(C65<>\"\",IF(VLOOKUP(C65,Reference!$A$3:$B$188,2,FALSE)=\"\",\"N/A\",VLOOKUP(C65,Reference!$A$3:$B$188,2,FALSE)),\"\")","v":140},null,null,null,"",null,null,null,null,null,null,null,null,"",null,null,null,null,null,null,{"$f":"IF(C65<>\"\",IF(VLOOKUP(C65,Reference!$I$3:$J$188,2,FALSE)=\" \",0,VLOOKUP(C65,Reference!$I$3:$J$188,2,FALSE)),\"\")","v":0.5},{"$f":"IF(C65<>\"\",IF(VLOOKUP(C65,Reference!$M$3:$Q$188,5,FALSE)=\" \",0,VLOOKUP(C65,Reference!$M$3:$Q$188,5,FALSE)),\"\")","v":0},""]
[null,null,"1,1,1-Trichloroethane",null,null,null,null,null,null,null,null,null,"<",null,null,null,null,null,null,{"$f":"IF(C66<>\"\",IF(VLOOKUP(C66,Reference!$A$3:$B$188,2,FALSE)=\"\",\"N/A\",VLOOKUP(C66,Reference!$A$3:$B$188,2,FALSE)),\"\")","v":610},null,null,null,"",null,null,null,null,null,null,null,null,"",null,null,null,null,null,null,{"$f":"IF(C66<>\"\",IF(VLOOKUP(C66,Reference!$I$3:$J$188,2,FALSE)=\" \",0,VLOOKUP(C66,Reference!$I$3:$J$188,2,FALSE)),\"\")","v":0.5},{"$f":"IF(C66<>\"\",IF(VLOOKUP(C66,Reference!$M$3:$Q$188,5,FALSE)=\" \",0,VLOOKUP(C66,Reference!$M$3:$Q$188,5,FALSE)),\"\")","v":0},""]
[null,null,"1,1,2-Trichloroethane",null,null,null,null,null,null,null,null,null,"<",null,null,null,null,null,null,{"$f":"IF(C67<>\"\",IF(VLOOKUP(C67,Reference!$A$3:$B$188,2,FALSE)=\"\",\"N/A\",VLOOKUP(C67,Reference!$A$3:$B$188,2,FALSE)),\"\")","v":0.59000000000000008},null,null,null,"",null,null,null,null,null,null,null,null,"",null,null,null,null,null,null,{"$f":"IF(C67<>\"\",IF(VLOOKUP(C67,Reference!$I$3:$J$188,2,FALSE)=\" \",0,VLOOKUP(C67,Reference!$I$3:$J$188,2,FALSE)),\"\")","v":0.5},{"$f":"IF(C67<>\"\",IF(VLOOKUP(C67,Reference!$M$3:$Q$188,5,FALSE)=\" \",0,VLOOKUP(C67,Reference!$M$3:$Q$188,5,FALSE)),\"\")","v":0},""]
[null,null,"Trichloroethylene",null,null,null,null,null,null,null,null,null,"<",null,null,null,null,null,null,{"$f":"IF(C68<>\"\",IF(VLOOKUP(C68,Reference!$A$3:$B$188,2,FALSE)=\"\",\"N/A\",VLOOKUP(C68,Reference!$A$3:$B$188,2,FALSE)),\"\")","v":2.5},null,null,null,"",null,null,null,null,null,null,null,null,"",null,null,null,null,null,null,{"$f":"IF(C68<>\"\",IF(VLOOKUP(C68,Reference!$I$3:$J$188,2,FALSE)=\" \",0,VLOOKUP(C68,Reference!$I$3:$J$188,2,FALSE)),\"\")","v":0.5},{"$f":"IF(C68<>\"\",IF(VLOOKUP(C68,Reference!$M$3:$Q$188,5,FALSE)=\" \",0,VLOOKUP(C68,Reference!$M$3:$Q$188,5,FALSE)),\"\")","v":0},""]
[null,null,"Vinyl Chloride",null,null,null,null,null,null,null,null,null,"<",null,null,null,null,null,null,{"$f":"IF(C69<>\"\",IF(VLOOKUP(C69,Reference!$A$3:$B$188,2,FALSE)=\"\",\"N/A\",VLOOKUP(C69,Reference!$A$3:$B$188,2,FALSE)),\"\")","v":2.5000000000000001E-2},null,null,null,"",null,null,null,null,null,null,null,null,"",null,null,null,null,null,null,{"$f":"IF(C69<>\"\",IF(VLOOKUP(C69,Reference!$I$3:$J$188,2,FALSE)=\" \",0,VLOOKUP(C69,Reference!$I$3:$J$188,2,FALSE)),\"\")","v":0.5},{"$f":"IF(C69<>\"\",IF(VLOOKUP(C69,Reference!$M$3:$Q$188,5,FALSE)=\" \",0,VLOOKUP(C69,Reference!$M$3:$Q$188,5,FALSE)),\"\")","v":0},""]
[null,"Group 4","2-Chlorophenol",null,null,null,null,null,null,null,null,null,"<",null,null,null,null,null,null,{"$f":"IF(C70<>\"\",IF(VLOOKUP(C70,Reference!$A$3:$B$188,2,FALSE)=\"\",\"N/A\",VLOOKUP(C70,Reference!$A$3:$B$188,2,FALSE)),\"\")","v":81},null,null,null,"",null,null,null,null,null,null,null,null,"",null,null,null,null,null,null,{"$f":"IF(C70<>\"\",IF(VLOOKUP(C70,Reference!$I$3:$J$188,2,FALSE)=\" \",0,VLOOKUP(C70,Reference!$I$3:$J$188,2,FALSE)),\"\")","v":10},{"$f":"IF(C70<>\"\",IF(VLOOKUP(C70,Reference!$M$3:$Q$188,5,FALSE)=\" \",0,VLOOKUP(C70,Reference!$M$3:$Q$188,5,FALSE)),\"\")","v":0},""]
[null,null,"2,4-Dichlorophenol",null,null,null,null,null,null,null,null,null,"<",null,null,null,null,null,null,{"$f":"IF(C71<>\"\",IF(VLOOKUP(C71,Reference!$A$3:$B$188,2,FALSE)=\"\",\"N/A\",VLOOKUP(C71,Reference!$A$3:$B$188,2,FALSE)),\"\")","v":77},null,null,null,"",null,null,null,null,null,null,null,null,"",null,null,null,null,null,null,{"$f":"IF(C71<>\"\",IF(VLOOKUP(C71,Reference!$I$3:$J$188,2,FALSE)=\" \",0,VLOOKUP(C71,Reference!$I$3:$J$188,2,FALSE)),\"\")","v":10},{"$f":"IF(C71<>\"\",IF(VLOOKUP(C71,Reference!$M$3:$Q$188,5,FALSE)=\" \",0,VLOOKUP(C71,Reference!$M$3:$Q$188,5,FALSE)),\"\")","v":0},""]
[null,null,"2,4-Dimethylphenol",null,null,null,null,null,null,null,null,null,"<",null,null,null,null,null,null,{"$f":"IF(C72<>\"\",IF(VLOOKUP(C72,Reference!$A$3:$B$188,2,FALSE)=\"\",\"N/A\",VLOOKUP(C72,Reference!$A$3:$B$188,2,FALSE)),\"\")","v":130},null,null,null,"",null,null,null,null,null,null,null,null,"",null,null,null,null,null,null,{"$f":"IF(C72<>\"\",IF(VLOOKUP(C72,Reference!$I$3:$J$188,2,FALSE)=\" \",0,VLOOKUP(C72,Reference!$I$3:$J$188,2,FALSE)),\"\")","v":10},{"$f":"IF(C72<>\"\",IF(VLOOKUP(C72,Reference!$M$3:$Q$188,5,FALSE)=\" \",0,VLOOKUP(C72,Reference!$M$3:$Q$188,5,FALSE)),\"\")","v":0},""]
[null,null,"4,6-Dinitro-o-Cresol",null,null,null,null,null,null,null,null,null,"<",null,null,null,null,null,null,{"$f":"IF(C73<>\"\",IF(VLOOKUP(C73,Reference!$A$3:$B$188,2,FALSE)=\"\",\"N/A\",VLOOKUP(C73,Reference!$A$3:$B$188,2,FALSE)),\"\")","v":13},null,null,null,"",null,null,null,null,null,null,null,null,"",null,null,null,null,null,null,{"$f":"IF(C73<>\"\",IF(VLOOKUP(C73,Reference!$I$3:$J$188,2,FALSE)=\" \",0,VLOOKUP(C73,Reference!$I$3:$J$188,2,FALSE)),\"\")","v":10},{"$f":"IF(C73<>\"\",IF(VLOOKUP(C73,Reference!$M$3:$Q$188,5,FALSE)=\" \",0,VLOOKUP(C73,Reference!$M$3:$Q$188,5,FALSE)),\"\")","v":0},""]
[null,null,"2,4-Dinitrophenol",null,null,null,null,null,null,null,null,null,"<",null,null,null,null,null,null,{"$f":"IF(C74<>\"\",IF(VLOOKUP(C74,Reference!$A$3:$B$188,2,FALSE)=\"\",\"N/A\",VLOOKUP(C74,Reference!$A$3:$B$188,2,FALSE)),\"\")","v":69},null,null,null,"",null,null,null,null,null,null,null,null,"",null,null,null,null,null,null,{"$f":"IF(C74<>\"\",IF(VLOOKUP(C74,Reference!$I$3:$J$188,2,FALSE)=\" \",0,VLOOKUP(C74,Reference!$I$3:$J$188,2,FALSE)),\"\")","v":10},{"$f":"IF(C74<>\"\",IF(VLOOKUP(C74,Reference!$M$3:$Q$188,5,FALSE)=\" \",0,VLOOKUP(C74,Reference!$M$3:$Q$188,5,FALSE)),\"\")","v":0},""]
[null,null,"2-Nitrophenol",null,null,null,null,null,null,null,null,null,"<",null,null,null,null,null,null,{"$f":"IF(C75<>\"\",IF(VLOOKUP(C75,Reference!$A$3:$B$188,2,FALSE)=\"\",\"N/A\",VLOOKUP(C75,Reference!$A$3:$B$188,2,FALSE)),\"\")","v":1600},null,null,null,"",null,null,null,null,null,null,null,null,"",null,null,null,null,null,null,{"$f":"IF(C75<>\"\",IF(VLOOKUP(C75,Reference!$I$3:$J$188,2,FALSE)=\" \",0,VLOOKUP(C75,Reference!$I$3:$J$188,2,FALSE)),\"\")","v":10},{"$f":"IF(C75<>\"\",IF(VLOOKUP(C75,Reference!$M$3:$Q$188,5,FALSE)=\" \",0,VLOOKUP(C75,Reference!$M$3:$Q$188,5,FALSE)),\"\")","v":0},""]
[null,null,"4-Nitrophenol",null,null,null,null,null,null,null,null,null,"<",null,null,null,null,null,null,{"$f":"IF(C76<>\"\",IF(VLOOKUP(C76,Reference!$A$3:$B$188,2,FALSE)=\"\",\"N/A\",VLOOKUP(C76,Reference!$A$3:$B$188,2,FALSE)),\"\")","v":470},null,null,null,"",null,null,null,null,null,null,null,null,"",null,null,null,null,null,null,{"$f":"IF(C76<>\"\",IF(VLOOKUP(C76,Reference!$I$3:$J$188,2,FALSE)=\" \",0,VLOOKUP(C76,Reference!$I$3:$J$188,2,FALSE)),\"\")","v":10},{"$f":"IF(C76<>\"\",IF(VLOOKUP(C76,Reference!$M$3:$Q$188,5,FALSE)=\" \",0,VLOOKUP(C76,Reference!$M$3:$Q$188,5,FALSE)),\"\")","v":0},""]
[null,null,"p-Chloro-m-Cresol",null,null,null,null,null,null,null,null,null,"<",null,null,null,null,null,null,{"$f":"IF(C77<>\"\",IF(VLOOKUP(C77,Reference!$A$3:$B$188,2,FALSE)=\"\",\"N/A\",VLOOKUP(C77,Reference!$A$3:$B$188,2,FALSE)),\"\")","v":30},null,null,null,"",null,null,null,null,null,null,null,null,"",null,null,null,null,null,null,{"$f":"IF(C77<>\"\",IF(VLOOKUP(C77,Reference!$I$3:$J$188,2,FALSE)=\" \",0,VLOOKUP(C77,Reference!$I$3:$J$188,2,FALSE)),\"\")","v":10},{"$f":"IF(C77<>\"\",IF(VLOOKUP(C77,Reference!$M$3:$Q$188,5,FALSE)=\" \",0,VLOOKUP(C77,Reference!$M$3:$Q$188,5,FALSE)),\"\")","v":0},""]
[null,null,"Pentachlorophenol",null,null,null,null,null,null,null,null,null,"<",null,null,null,null,null,null,{"$f":"IF(C78<>\"\",IF(VLOOKUP(C78,Reference!$A$3:$B$188,2,FALSE)=\"\",\"N/A\",VLOOKUP(C78,Reference!$A$3:$B$188,2,FALSE)),\"\")","v":0.27},null,null,null,"",null,null,null,null,null,null,null,null,"",null,null,null,null,null,null,{"$f":"IF(C78<>\"\",IF(VLOOKUP(C78,Reference!$I$3:$J$188,2,FALSE)=\" \",0,VLOOKUP(C78,Reference!$I$3:$J$188,2,FALSE)),\"\")","v":10},{"$f":"IF(C78<>\"\",IF(VLOOKUP(C78,Reference!$M$3:$Q$188,5,FALSE)=\" \",0,VLOOKUP(C78,Reference!$M$3:$Q$188,5,FALSE)),\"\")","v":0},""]
[null,null,"Phenol",null,null,null,null,null,null,null,null,null,"<",null,null,null,null,null,null,{"$f":"IF(C79<>\"\",IF(VLOOKUP(C79,Reference!$A$3:$B$188,2,FALSE)=\"\",\"N/A\",VLOOKUP(C79,Reference!$A$3:$B$188,2,FALSE)),\"\")","v":10400},null,null,null,"",null,null,null,null,null,null,null,null,"",null,null,null,null,null,null,{"$f":"IF(C79<>\"\",IF(VLOOKUP(C79,Reference!$I$3:$J$188,2,FALSE)=\" \",0,VLOOKUP(C79,Reference!$I$3:$J$188,2,FALSE)),\"\")","v":10},{"$f":"IF(C79<>\"\",IF(VLOOKUP(C79,Reference!$M$3:$Q$188,5,FALSE)=\" \",0,VLOOKUP(C79,Reference!$M$3:$Q$188,5,FALSE)),\"\")","v":0},""]
[null,null,"2,4,6-Trichlorophenol",null,null,null,null,null,null,null,null,null,"<",null,null,null,null,null,null,{"$f":"IF(C80<>\"\",IF(VLOOKUP(C80,Reference!$A$3:$B$188,2,FALSE)=\"\",\"N/A\",VLOOKUP(C80,Reference!$A$3:$B$188,2,FALSE)),\"\")","v":1.4},null,null,null,"",null,null,null,null,null,null,null,null,"",null,null,null,null,null,null,{"$f":"IF(C80<>\"\",IF(VLOOKUP(C80,Reference!$I$3:$J$188,2,FALSE)=\" \",0,VLOOKUP(C80,Reference!$I$3:$J$188,2,FALSE)),\"\")","v":10},{"$f":"IF(C80<>\"\",IF(VLOOKUP(C80,Reference!$M$3:$Q$188,5,FALSE)=\" \",0,VLOOKUP(C80,Reference!$M$3:$Q$188,5,FALSE)),\"\")","v":0},""]
[null,"Group 5","Acenaphthene",null,null,null,null,null,null,null,null,null,"<",null,null,null,null,null,null,{"$f":"IF(C81<>\"\",IF(VLOOKUP(C81,Reference!$A$3:$B$188,2,FALSE)=\"\",\"N/A\",VLOOKUP(C81,Reference!$A$3:$B$188,2,FALSE)),\"\")","v":17},null,null,null,"",null,null,null,null,null,null,null,null,"",null,null,null,null,null,null,{"$f":"IF(C81<>\"\",IF(VLOOKUP(C81,Reference!$I$3:$J$188,2,FALSE)=\" \",0,VLOOKUP(C81,Reference!$I$3:$J$188,2,FALSE)),\"\")","v":2.5},{"$f":"IF(C81<>\"\",IF(VLOOKUP(C81,Reference!$M$3:$Q$188,5,FALSE)=\" \",0,VLOOKUP(C81,Reference!$M$3:$Q$188,5,FALSE)),\"\")","v":0},""]
[null,null,"Acenaphthylene",null,null,null,null,null,null,null,null,null,"<",null,null,null,null,null,null,{"$f":"IF(C82<>\"\",IF(VLOOKUP(C82,Reference!$A$3:$B$188,2,FALSE)=\"\",\"N/A\",VLOOKUP(C82,Reference!$A$3:$B$188,2,FALSE)),\"\")","v":"N/A"},null,null,null,"",null,null,null,null,null,null,null,null,"",null,null,null,null,null,null,{"$f":"IF(C82<>\"\",IF(VLOOKUP(C82,Reference!$I$3:$J$188,2,FALSE)=\" \",0,VLOOKUP(C82,Reference!$I$3:$J$188,2,FALSE)),\"\")","v":2.5},{"$f":"IF(C82<>\"\",IF(VLOOKUP(C82,Reference!$M$3:$Q$188,5,FALSE)=\" \",0,VLOOKUP(C82,Reference!$M$3:$Q$188,5,FALSE)),\"\")","v":0},""]
[null,null,"Anthracene",null,null,null,null,null,null,null,null,null,"<",null,null,null,null,null,null,{"$f":"IF(C83<>\"\",IF(VLOOKUP(C83,Reference!$A$3:$B$188,2,FALSE)=\"\",\"N/A\",VLOOKUP(C83,Reference!$A$3:$B$188,2,FALSE)),\"\")","v":8300},null,null,null,{"$f":"IF(AND(C83<>\"\",N83<>\"\",$J$8<>\"\",$Z$7<>\"\"),IF(T83<>\"N/A\",IF(AND(N83<=VALUE(AN83),M83=\"<\"),\"No (Value < QL)\",IF($AP$9=\"No\",IF(N83>=(0.5*T83),IF(AND(M83=\"<\",N83=(0.5*T83)),\"No\",\"Yes\"),\"No\"),IF(N83>=T83,IF(AND(M83=\"<\",N83=T83),\"No\",\"Yes\"),\"No\"))),\"No\"),\"\")","v":""},null,null,null,null,null,null,null,null,"",null,null,null,null,null,null,{"$f":"IF(C83<>\"\",IF(VLOOKUP(C83,Reference!$I$3:$J$188,2,FALSE)=\" \",0,VLOOKUP(C83,Reference!$I$3:$J$188,2,FALSE)),\"\")","v":2.5},{"$f":"IF(C83<>\"\",IF(VLOOKUP(C83,Reference!$M$3:$Q$188,5,FALSE)=\" \",0,VLOOKUP(C83,Reference!$M$3:$Q$188,5,FALSE)),\"\")","v":0},{"$f":"IF(AND(X83=\"Yes\",AC83<>\"\"),IF((N83/AC83)>=0.5,\"Establish Limits\",IF(AND(AO83=\"Y\",(N83/AC83)>0.1),\"Monitor\",IF(AND(AO83<>\"Y\",(N83/AC83)>0.25),\"Monitor\",\"No Limits/Monitoring\"))),\"\")","v":""}]
[null,null,"Benzidine",null,null,null,null,null,null,null,null,null,"<",null,null,null,null,null,null,{"$f":"IF(C84<>\"\",IF(VLOOKUP(C84,Reference!$A$3:$B$188,2,FALSE)=\"\",\"N/A\",VLOOKUP(C84,Reference!$A$3:$B$188,2,FALSE)),\"\")","v":8.6000000000000003E-5},null,null,null,"",null,null,null,null,null,null,null,null,"",null,null,null,null,null,null,{"$f":"IF(C84<>\"\",IF(VLOOKUP(C84,Reference!$I$3:$J$188,2,FALSE)=\" \",0,VLOOKUP(C84,Reference!$I$3:$J$188,2,FALSE)),\"\")","v":50},{"$f":"IF(C84<>\"\",IF(VLOOKUP(C84,Reference!$M$3:$Q$188,5,FALSE)=\" \",0,VLOOKUP(C84,Reference!$M$3:$Q$188,5,FALSE)),\"\")","v":0},""]
[null,null,"Benzo(a)Anthracene",null,null,null,null,null,null,null,null,null,"<",null,null,null,null,null,null,{"$f":"IF(C85<>\"\",IF(VLOOKUP(C85,Reference!$A$3:$B$188,2,FALSE)=\"\",\"N/A\",VLOOKUP(C85,Reference!$A$3:$B$188,2,FALSE)),\"\")","v":3.8E-3},null,null,null,"",null,null,null,null,null,null,null,null,"",null,null,null,null,null,null,{"$f":"IF(C85<>\"\",IF(VLOOKUP(C85,Reference!$I$3:$J$188,2,FALSE)=\" \",0,VLOOKUP(C85,Reference!$I$3:$J$188,2,FALSE)),\"\")","v":2.5},{"$f":"IF(C85<>\"\",IF(VLOOKUP(C85,Reference!$M$3:$Q$188,5,FALSE)=\" \",0,VLOOKUP(C85,Reference!$M$3:$Q$188,5,FALSE)),\"\")","v":0},""]
[null,null,"Benzo(a)Pyrene",null,null,null,null,null,null,null,null,null,"<",null,null,null,null,null,null,{"$f":"IF(C86<>\"\",IF(VLOOKUP(C86,Reference!$A$3:$B$188,2,FALSE)=\"\",\"N/A\",VLOOKUP(C86,Reference!$A$3:$B$188,2,FALSE)),\"\")","v":3.8E-3},null,null,null,"",null,null,null,null,null,null,null,null,{"$f":"IF($N86<>\"\",IF(AND(X86=\"Yes\",AC86<>\"\"),IF(($N86/$AC86)>=0.5,\"Establish Limits\",IF(AND($AO86=\"Y\",($N86/$AC86)>0.1),\"Monitor\",IF(AND($AO86<>\"Y\",($N86/$AC86)>0.25),\"Monitor\",\"No Limits/Monitoring\"))),\"\"),\"\")","v":""},null,null,null,null,null,null,{"$f":"IF(C86<>\"\",IF(VLOOKUP(C86,Reference!$I$3:$J$188,2,FALSE)=\" \",0,VLOOKUP(C86,Reference!$I$3:$J$188,2,FALSE)),\"\")","v":2.5},{"$f":"IF(C86<>\"\",IF(VLOOKUP(C86,Reference!$M$3:$Q$188,5,FALSE)=\" \",0,VLOOKUP(C86,Reference!$M$3:$Q$188,5,FALSE)),\"\")","v":0},""]
[null,null,"3,4-Benzofluoranthene",null,null,null,null,null,null,null,null,null,"<",null,null,null,null,null,null,{"$f":"IF(C87<>\"\",IF(VLOOKUP(C87,Reference!$A$3:$B$188,2,FALSE)=\"\",\"N/A\",VLOOKUP(C87,Reference!$A$3:$B$188,2,FALSE)),\"\")","v":3.8E-3},null,null,null,"",null,null,null,null,null,null,null,null,"",null,null,null,null,null,null,{"$f":"IF(C87<>\"\",IF(VLOOKUP(C87,Reference!$I$3:$J$188,2,FALSE)=\" \",0,VLOOKUP(C87,Reference!$I$3:$J$188,2,FALSE)),\"\")","v":2.5},{"$f":"IF(C87<>\"\",IF(VLOOKUP(C87,Reference!$M$3:$Q$188,5,FALSE)=\" \",0,VLOOKUP(C87,Reference!$M$3:$Q$188,5,FALSE)),\"\")","v":0},""]
[null,null,"Benzo(ghi)Perylene",null,null,null,null,null,null,null,null,null,"<",null,null,null,null,null,null,{"$f":"IF(C88<>\"\",IF(VLOOKUP(C88,Reference!$A$3:$B$188,2,FALSE)=\"\",\"N/A\",VLOOKUP(C88,Reference!$A$3:$B$188,2,FALSE)),\"\")","v":"N/A"},null,null,null,"",null,null,null,null,null,null,null,null,"",null,null,null,null,null,null,{"$f":"IF(C88<>\"\",IF(VLOOKUP(C88,Reference!$I$3:$J$188,2,FALSE)=\" \",0,VLOOKUP(C88,Reference!$I$3:$J$188,2,FALSE)),\"\")","v":2.5},{"$f":"IF(C88<>\"\",IF(VLOOKUP(C88,Reference!$M$3:$Q$188,5,FALSE)=\" \",0,VLOOKUP(C88,Reference!$M$3:$Q$188,5,FALSE)),\"\")","v":0},""]
[null,null,"Benzo(k)Fluoranthene",null,null,null,null,null,null,null,null,null,"<",null,null,null,null,null,null,{"$f":"IF(C89<>\"\",IF(VLOOKUP(C89,Reference!$A$3:$B$188,2,FALSE)=\"\",\"N/A\",VLOOKUP(C89,Reference!$A$3:$B$188,2,FALSE)),\"\")","v":3.8E-3},null,null,null,"",null,null,null,null,null,null,null,null,"",null,null,null,null,null,null,{"$f":"IF(C89<>\"\",IF(VLOOKUP(C89,Reference!$I$3:$J$188,2,FALSE)=\" \",0,VLOOKUP(C89,Reference!$I$3:$J$188,2,FALSE)),\"\")","v":2.5},{"$f":"IF(C89<>\"\",IF(VLOOKUP(C89,Reference!$M$3:$Q$188,5,FALSE)=\" \",0,VLOOKUP(C89,Reference!$M$3:$Q$188,5,FALSE)),\"\")","v":0},""]
[null,null,"Bis(2-Chloroethoxy)Methane",null,null,null,null,null,null,null,null,null,"<",null,null,null,null,null,null,{"$f":"IF(C90<>\"\",IF(VLOOKUP(C90,Reference!$A$3:$B$188,2,FALSE)=\"\",\"N/A\",VLOOKUP(C90,Reference!$A$3:$B$188,2,FALSE)),\"\")","v":"N/A"},null,null,null,"",null,null,null,null,null,null,null,null,"",null,null,null,null,null,null,{"$f":"IF(C90<>\"\",IF(VLOOKUP(C90,Reference!$I$3:$J$188,2,FALSE)=\" \",0,VLOOKUP(C90,Reference!$I$3:$J$188,2,FALSE)),\"\")","v":5},{"$f":"IF(C90<>\"\",IF(VLOOKUP(C90,Reference!$M$3:$Q$188,5,FALSE)=\" \",0,VLOOKUP(C90,Reference!$M$3:$Q$188,5,FALSE)),\"\")","v":0},""]
[null,null,"Bis(2-Chloroethyl)Ether",null,null,null,null,null,null,null,null,null,"<",null,null,null,null,null,null,{"$f":"IF(C91<>\"\",IF(VLOOKUP(C91,Reference!$A$3:$B$188,2,FALSE)=\"\",\"N/A\",VLOOKUP(C91,Reference!$A$3:$B$188,2,FALSE)),\"\")","v":3.0000000000000002E-2},null,null,null,"",null,null,null,null,null,null,null,null,"",null,null,null,null,null,null,{"$f":"IF(C91<>\"\",IF(VLOOKUP(C91,Reference!$I$3:$J$188,2,FALSE)=\" \",0,VLOOKUP(C91,Reference!$I$3:$J$188,2,FALSE)),\"\")","v":5},{"$f":"IF(C91<>\"\",IF(VLOOKUP(C91,Reference!$M$3:$Q$188,5,FALSE)=\" \",0,VLOOKUP(C91,Reference!$M$3:$Q$188,5,FALSE)),\"\")","v":0},""]
[null,null,"Bis(2-Chloroisopropyl)Ether",null,null,null,null,null,null,null,null,null,"<",null,null,null,null,null,null,{"$f":"IF(C92<>\"\",IF(VLOOKUP(C92,Reference!$A$3:$B$188,2,FALSE)=\"\",\"N/A\",VLOOKUP(C92,Reference!$A$3:$B$188,2,FALSE)),\"\")","v":1400},null,null,null,"",null,null,null,null,null,null,null,null,"",null,null,null,null,null,null,{"$f":"IF(C92<>\"\",IF(VLOOKUP(C92,Reference!$I$3:$J$188,2,FALSE)=\" \",0,VLOOKUP(C92,Reference!$I$3:$J$188,2,FALSE)),\"\")","v":5},{"$f":"IF(C92<>\"\",IF(VLOOKUP(C92,Reference!$M$3:$Q$188,5,FALSE)=\" \",0,VLOOKUP(C92,Reference!$M$3:$Q$188,5,FALSE)),\"\")","v":0},""]
[null,null,"Bis(2-Ethylhexyl)Phthalate",null,null,null,null,null,null,null,null,null,"<",null,null,null,null,null,null,{"$f":"IF(C93<>\"\",IF(VLOOKUP(C93,Reference!$A$3:$B$188,2,FALSE)=\"\",\"N/A\",VLOOKUP(C93,Reference!$A$3:$B$188,2,FALSE)),\"\")","v":1.2},null,null,null,"",null,null,null,null,null,null,null,null,"",null,null,null,null,null,null,{"$f":"IF(C93<>\"\",IF(VLOOKUP(C93,Reference!$I$3:$J$188,2,FALSE)=\" \",0,VLOOKUP(C93,Reference!$I$3:$J$188,2,FALSE)),\"\")","v":5},{"$f":"IF(C93<>\"\",IF(VLOOKUP(C93,Reference!$M$3:$Q$188,5,FALSE)=\" \",0,VLOOKUP(C93,Reference!$M$3:$Q$188,5,FALSE)),\"\")","v":0},""]
[null,null,"4-Bromophenyl Phenyl Ether",null,null,null,null,null,null,null,null,null,"<",null,null,null,null,null,null,{"$f":"IF(C94<>\"\",IF(VLOOKUP(C94,Reference!$A$3:$B$188,2,FALSE)=\"\",\"N/A\",VLOOKUP(C94,Reference!$A$3:$B$188,2,FALSE)),\"\")","v":54},null,null,null,"",null,null,null,null,null,null,null,null,"",null,null,null,null,null,null,{"$f":"IF(C94<>\"\",IF(VLOOKUP(C94,Reference!$I$3:$J$188,2,FALSE)=\" \",0,VLOOKUP(C94,Reference!$I$3:$J$188,2,FALSE)),\"\")","v":5},{"$f":"IF(C94<>\"\",IF(VLOOKUP(C94,Reference!$M$3:$Q$188,5,FALSE)=\" \",0,VLOOKUP(C94,Reference!$M$3:$Q$188,5,FALSE)),\"\")","v":0},""]
[null,null,"Butyl Benzyl Phthalate",null,null,null,null,null,null,null,null,null,"<",null,null,null,null,null,null,{"$f":"IF(C95<>\"\",IF(VLOOKUP(C95,Reference!$A$3:$B$188,2,FALSE)=\"\",\"N/A\",VLOOKUP(C95,Reference!$A$3:$B$188,2,FALSE)),\"\")","v":35},null,null,null,"",null,null,null,null,null,null,null,null,"",null,null,null,null,null,null,{"$f":"IF(C95<>\"\",IF(VLOOKUP(C95,Reference!$I$3:$J$188,2,FALSE)=\" \",0,VLOOKUP(C95,Reference!$I$3:$J$188,2,FALSE)),\"\")","v":5},{"$f":"IF(C95<>\"\",IF(VLOOKUP(C95,Reference!$M$3:$Q$188,5,FALSE)=\" \",0,VLOOKUP(C95,Reference!$M$3:$Q$188,5,FALSE)),\"\")","v":0},""]
[null,null,"2-Chloronaphthalene",null,null,null,null,null,null,null,null,null,"<",null,null,null,null,null,null,{"$f":"IF(C96<>\"\",IF(VLOOKUP(C96,Reference!$A$3:$B$188,2,FALSE)=\"\",\"N/A\",VLOOKUP(C96,Reference!$A$3:$B$188,2,FALSE)),\"\")","v":1000},null,null,null,"",null,null,null,null,null,null,null,null,"",null,null,null,null,null,null,{"$f":"IF(C96<>\"\",IF(VLOOKUP(C96,Reference!$I$3:$J$188,2,FALSE)=\" \",0,VLOOKUP(C96,Reference!$I$3:$J$188,2,FALSE)),\"\")","v":5},{"$f":"IF(C96<>\"\",IF(VLOOKUP(C96,Reference!$M$3:$Q$188,5,FALSE)=\" \",0,VLOOKUP(C96,Reference!$M$3:$Q$188,5,FALSE)),\"\")","v":0},""]
[null,null,"4-Chlorophenyl Phenyl Ether",null,null,null,null,null,null,null,null,null,"<",null,null,null,null,null,null,{"$f":"IF(C97<>\"\",IF(VLOOKUP(C97,Reference!$A$3:$B$188,2,FALSE)=\"\",\"N/A\",VLOOKUP(C97,Reference!$A$3:$B$188,2,FALSE)),\"\")","v":"N/A"},null,null,null,"",null,null,null,null,null,null,null,null,"",null,null,null,null,null,null,{"$f":"IF(C97<>\"\",IF(VLOOKUP(C97,Reference!$I$3:$J$188,2,FALSE)=\" \",0,VLOOKUP(C97,Reference!$I$3:$J$188,2,FALSE)),\"\")","v":5},{"$f":"IF(C97<>\"\",IF(VLOOKUP(C97,Reference!$M$3:$Q$188,5,FALSE)=\" \",0,VLOOKUP(C97,Reference!$M$3:$Q$188,5,FALSE)),\"\")","v":0},""]
[null,null,"Chrysene",null,null,null,null,null,null,null,null,null,"<",null,null,null,null,null,null,{"$f":"IF(C98<>\"\",IF(VLOOKUP(C98,Reference!$A$3:$B$188,2,FALSE)=\"\",\"N/A\",VLOOKUP(C98,Reference!$A$3:$B$188,2,FALSE)),\"\")","v":3.8E-3},null,null,null,"",null,null,null,null,null,null,null,null,"",null,null,null,null,null,null,{"$f":"IF(C98<>\"\",IF(VLOOKUP(C98,Reference!$I$3:$J$188,2,FALSE)=\" \",0,VLOOKUP(C98,Reference!$I$3:$J$188,2,FALSE)),\"\")","v":2.5},{"$f":"IF(C98<>\"\",IF(VLOOKUP(C98,Reference!$M$3:$Q$188,5,FALSE)=\" \",0,VLOOKUP(C98,Reference!$M$3:$Q$188,5,FALSE)),\"\")","v":0},""]
[null,null,"Dibenzo(a,h)Anthrancene",null,null,null,null,null,null,null,null,null,"<",null,null,null,null,null,null,{"$f":"IF(C99<>\"\",IF(VLOOKUP(C99,Reference!$A$3:$B$188,2,FALSE)=\"\",\"N/A\",VLOOKUP(C99,Reference!$A$3:$B$188,2,FALSE)),\"\")","v":3.8E-3},null,null,null,"",null,null,null,null,null,null,null,null,"",null,null,null,null,null,null,{"$f":"IF(C99<>\"\",IF(VLOOKUP(C99,Reference!$I$3:$J$188,2,FALSE)=\" \",0,VLOOKUP(C99,Reference!$I$3:$J$188,2,FALSE)),\"\")","v":2.5},{"$f":"IF(C99<>\"\",IF(VLOOKUP(C99,Reference!$M$3:$Q$188,5,FALSE)=\" \",0,VLOOKUP(C99,Reference!$M$3:$Q$188,5,FALSE)),\"\")","v":0},""]
[null,null,"1,2-Dichlorobenzene",null,null,null,null,null,null,null,null,null,"<",null,null,null,null,null,null,{"$f":"IF(C100<>\"\",IF(VLOOKUP(C100,Reference!$A$3:$B$188,2,FALSE)=\"\",\"N/A\",VLOOKUP(C100,Reference!$A$3:$B$188,2,FALSE)),\"\")","v":160},null,null,null,"",null,null,null,null,null,null,null,null,"",null,null,null,null,null,null,{"$f":"IF(C100<>\"\",IF(VLOOKUP(C100,Reference!$I$3:$J$188,2,FALSE)=\" \",0,VLOOKUP(C100,Reference!$I$3:$J$188,2,FALSE)),\"\")","v":0.5},{"$f":"IF(C100<>\"\",IF(VLOOKUP(C100,Reference!$M$3:$Q$188,5,FALSE)=\" \",0,VLOOKUP(C100,Reference!$M$3:$Q$188,5,FALSE)),\"\")","v":0},""]
[null,null,"1,3-Dichlorobenzene",null,null,null,null,null,null,null,null,null,"<",null,null,null,null,null,null,{"$f":"IF(C101<>\"\",IF(VLOOKUP(C101,Reference!$A$3:$B$188,2,FALSE)=\"\",\"N/A\",VLOOKUP(C101,Reference!$A$3:$B$188,2,FALSE)),\"\")","v":69},null,null,null,"",null,null,null,null,null,null,null,null,"",null,null,null,null,null,null,{"$f":"IF(C101<>\"\",IF(VLOOKUP(C101,Reference!$I$3:$J$188,2,FALSE)=\" \",0,VLOOKUP(C101,Reference!$I$3:$J$188,2,FALSE)),\"\")","v":0.5},{"$f":"IF(C101<>\"\",IF(VLOOKUP(C101,Reference!$M$3:$Q$188,5,FALSE)=\" \",0,VLOOKUP(C101,Reference!$M$3:$Q$188,5,FALSE)),\"\")","v":0},""]
[null,null,"1,4-Dichlorobenzene",null,null,null,null,null,null,null,null,null,"<",null,null,null,null,null,null,{"$f":"IF(C102<>\"\",IF(VLOOKUP(C102,Reference!$A$3:$B$188,2,FALSE)=\"\",\"N/A\",VLOOKUP(C102,Reference!$A$3:$B$188,2,FALSE)),\"\")","v":150},null,null,null,"",null,null,null,null,null,null,null,null,"",null,null,null,null,null,null,{"$f":"IF(C102<>\"\",IF(VLOOKUP(C102,Reference!$I$3:$J$188,2,FALSE)=\" \",0,VLOOKUP(C102,Reference!$I$3:$J$188,2,FALSE)),\"\")","v":0.5},{"$f":"IF(C102<>\"\",IF(VLOOKUP(C102,Reference!$M$3:$Q$188,5,FALSE)=\" \",0,VLOOKUP(C102,Reference!$M$3:$Q$188,5,FALSE)),\"\")","v":0},""]
[null,null,"3,3-Dichlorobenzidine",null,null,null,null,null,null,null,null,null,"<",null,null,null,null,null,null,{"$f":"IF(C103<>\"\",IF(VLOOKUP(C103,Reference!$A$3:$B$188,2,FALSE)=\"\",\"N/A\",VLOOKUP(C103,Reference!$A$3:$B$188,2,FALSE)),\"\")","v":2.0999999999999998E-2},null,null,null,"",null,null,null,null,null,null,null,null,"",null,null,null,null,null,null,{"$f":"IF(C103<>\"\",IF(VLOOKUP(C103,Reference!$I$3:$J$188,2,FALSE)=\" \",0,VLOOKUP(C103,Reference!$I$3:$J$188,2,FALSE)),\"\")","v":5},{"$f":"IF(C103<>\"\",IF(VLOOKUP(C103,Reference!$M$3:$Q$188,5,FALSE)=\" \",0,VLOOKUP(C103,Reference!$M$3:$Q$188,5,FALSE)),\"\")","v":0},""]
[null,null,"Diethyl Phthalate",null,null,null,null,null,null,null,null,null,"<",null,null,null,null,null,null,{"$f":"IF(C104<>\"\",IF(VLOOKUP(C104,Reference!$A$3:$B$188,2,FALSE)=\"\",\"N/A\",VLOOKUP(C104,Reference!$A$3:$B$188,2,FALSE)),\"\")","v":800},null,null,null,"",null,null,null,null,null,null,null,null,"",null,null,null,null,null,null,{"$f":"IF(C104<>\"\",IF(VLOOKUP(C104,Reference!$I$3:$J$188,2,FALSE)=\" \",0,VLOOKUP(C104,Reference!$I$3:$J$188,2,FALSE)),\"\")","v":5},{"$f":"IF(C104<>\"\",IF(VLOOKUP(C104,Reference!$M$3:$Q$188,5,FALSE)=\" \",0,VLOOKUP(C104,Reference!$M$3:$Q$188,5,FALSE)),\"\")","v":0},""]
[null,null,"Dimethyl Phthalate",null,null,null,null,null,null,null,null,null,"<",null,null,null,null,null,null,{"$f":"IF(C105<>\"\",IF(VLOOKUP(C105,Reference!$A$3:$B$188,2,FALSE)=\"\",\"N/A\",VLOOKUP(C105,Reference!$A$3:$B$188,2,FALSE)),\"\")","v":500},null,null,null,"",null,null,null,null,null,null,null,null,"",null,null,null,null,null,null,{"$f":"IF(C105<>\"\",IF(VLOOKUP(C105,Reference!$I$3:$J$188,2,FALSE)=\" \",0,VLOOKUP(C105,Reference!$I$3:$J$188,2,FALSE)),\"\")","v":5},{"$f":"IF(C105<>\"\",IF(VLOOKUP(C105,Reference!$M$3:$Q$188,5,FALSE)=\" \",0,VLOOKUP(C105,Reference!$M$3:$Q$188,5,FALSE)),\"\")","v":0},""]
[null,null,"Di-n-Butyl Phthalate",null,null,null,null,null,null,null,null,null,"<",null,null,null,null,null,null,{"$f":"IF(C106<>\"\",IF(VLOOKUP(C106,Reference!$A$3:$B$188,2,FALSE)=\"\",\"N/A\",VLOOKUP(C106,Reference!$A$3:$B$188,2,FALSE)),\"\")","v":21},null,null,null,"",null,null,null,null,null,null,null,null,"",null,null,null,null,null,null,{"$f":"IF(C106<>\"\",IF(VLOOKUP(C106,Reference!$I$3:$J$188,2,FALSE)=\" \",0,VLOOKUP(C106,Reference!$I$3:$J$188,2,FALSE)),\"\")","v":5},{"$f":"IF(C106<>\"\",IF(VLOOKUP(C106,Reference!$M$3:$Q$188,5,FALSE)=\" \",0,VLOOKUP(C106,Reference!$M$3:$Q$188,5,FALSE)),\"\")","v":0},""]
[null,null,"2,4-Dinitrotoluene",null,null,null,null,null,null,null,null,null,"<",null,null,null,null,null,null,{"$f":"IF(C107<>\"\",IF(VLOOKUP(C107,Reference!$A$3:$B$188,2,FALSE)=\"\",\"N/A\",VLOOKUP(C107,Reference!$A$3:$B$188,2,FALSE)),\"\")","v":0.05},null,null,null,"",null,null,null,null,null,null,null,null,"",null,null,null,null,null,null,{"$f":"IF(C107<>\"\",IF(VLOOKUP(C107,Reference!$I$3:$J$188,2,FALSE)=\" \",0,VLOOKUP(C107,Reference!$I$3:$J$188,2,FALSE)),\"\")","v":5},{"$f":"IF(C107<>\"\",IF(VLOOKUP(C107,Reference!$M$3:$Q$188,5,FALSE)=\" \",0,VLOOKUP(C107,Reference!$M$3:$Q$188,5,FALSE)),\"\")","v":0},""]
[null,null,"2,6-Dinitrotoluene",null,null,null,null,null,null,null,null,null,"<",null,null,null,null,null,null,{"$f":"IF(C108<>\"\",IF(VLOOKUP(C108,Reference!$A$3:$B$188,2,FALSE)=\"\",\"N/A\",VLOOKUP(C108,Reference!$A$3:$B$188,2,FALSE)),\"\")","v":0.05},null,null,null,"",null,null,null,null,null,null,null,null,"",null,null,null,null,null,null,{"$f":"IF(C108<>\"\",IF(VLOOKUP(C108,Reference!$I$3:$J$188,2,FALSE)=\" \",0,VLOOKUP(C108,Reference!$I$3:$J$188,2,FALSE)),\"\")","v":5},{"$f":"IF(C108<>\"\",IF(VLOOKUP(C108,Reference!$M$3:$Q$188,5,FALSE)=\" \",0,VLOOKUP(C108,Reference!$M$3:$Q$188,5,FALSE)),\"\")","v":0},""]
[null,null,"Di-n-Octyl Phthalate",null,null,null,null,null,null,null,null,null,"<",null,null,null,null,null,null,{"$f":"IF(C109<>\"\",IF(VLOOKUP(C109,Reference!$A$3:$B$188,2,FALSE)=\"\",\"N/A\",VLOOKUP(C109,Reference!$A$3:$B$188,2,FALSE)),\"\")","v":"N/A"},null,null,null,"",null,null,null,null,null,null,null,null,"",null,null,null,null,null,null,{"$f":"IF(C109<>\"\",IF(VLOOKUP(C109,Reference!$I$3:$J$188,2,FALSE)=\" \",0,VLOOKUP(C109,Reference!$I$3:$J$188,2,FALSE)),\"\")","v":5},{"$f":"IF(C109<>\"\",IF(VLOOKUP(C109,Reference!$M$3:$Q$188,5,FALSE)=\" \",0,VLOOKUP(C109,Reference!$M$3:$Q$188,5,FALSE)),\"\")","v":0},""]
[null,null,"1,2-Diphenylhydrazine",null,null,null,null,null,null,null,null,null,"<",null,null,null,null,null,null,{"$f":"IF(C110<>\"\",IF(VLOOKUP(C110,Reference!$A$3:$B$188,2,FALSE)=\"\",\"N/A\",VLOOKUP(C110,Reference!$A$3:$B$188,2,FALSE)),\"\")","v":3.6000000000000004E-2},null,null,null,"",null,null,null,null,null,null,null,null,"",null,null,null,null,null,null,{"$f":"IF(C110<>\"\",IF(VLOOKUP(C110,Reference!$I$3:$J$188,2,FALSE)=\" \",0,VLOOKUP(C110,Reference!$I$3:$J$188,2,FALSE)),\"\")","v":10},{"$f":"IF(C110<>\"\",IF(VLOOKUP(C110,Reference!$M$3:$Q$188,5,FALSE)=\" \",0,VLOOKUP(C110,Reference!$M$3:$Q$188,5,FALSE)),\"\")","v":0},""]
[null,null,"Fluoranthene",null,null,null,null,null,null,null,null,null,"<",null,null,null,null,null,null,{"$f":"IF(C111<>\"\",IF(VLOOKUP(C111,Reference!$A$3:$B$188,2,FALSE)=\"\",\"N/A\",VLOOKUP(C111,Reference!$A$3:$B$188,2,FALSE)),\"\")","v":40},null,null,null,"",null,null,null,null,null,null,null,null,"",null,null,null,null,null,null,{"$f":"IF(C111<>\"\",IF(VLOOKUP(C111,Reference!$I$3:$J$188,2,FALSE)=\" \",0,VLOOKUP(C111,Reference!$I$3:$J$188,2,FALSE)),\"\")","v":2.5},{"$f":"IF(C111<>\"\",IF(VLOOKUP(C111,Reference!$M$3:$Q$188,5,FALSE)=\" \",0,VLOOKUP(C111,Reference!$M$3:$Q$188,5,FALSE)),\"\")","v":0},""]
[null,null,"Fluorene",null,null,null,null,null,null,null,null,null,"<",null,null,null,null,null,null,{"$f":"IF(C112<>\"\",IF(VLOOKUP(C112,Reference!$A$3:$B$188,2,FALSE)=\"\",\"N/A\",VLOOKUP(C112,Reference!$A$3:$B$188,2,FALSE)),\"\")","v":1100},null,null,null,"",null,null,null,null,null,null,null,null,"",null,null,null,null,null,null,{"$f":"IF(C112<>\"\",IF(VLOOKUP(C112,Reference!$I$3:$J$188,2,FALSE)=\" \",0,VLOOKUP(C112,Reference!$I$3:$J$188,2,FALSE)),\"\")","v":2.5},{"$f":"IF(C112<>\"\",IF(VLOOKUP(C112,Reference!$M$3:$Q$188,5,FALSE)=\" \",0,VLOOKUP(C112,Reference!$M$3:$Q$188,5,FALSE)),\"\")","v":0},""]
[null,null,"Hexachlorobenzene",null,null,null,null,null,null,null,null,null,"<",null,null,null,null,null,null,{"$f":"IF(C113<>\"\",IF(VLOOKUP(C113,Reference!$A$3:$B$188,2,FALSE)=\"\",\"N/A\",VLOOKUP(C113,Reference!$A$3:$B$188,2,FALSE)),\"\")","v":2.8000000000000003E-4},null,null,null,"",null,null,null,null,null,null,null,null,"",null,null,null,null,null,null,{"$f":"IF(C113<>\"\",IF(VLOOKUP(C113,Reference!$I$3:$J$188,2,FALSE)=\" \",0,VLOOKUP(C113,Reference!$I$3:$J$188,2,FALSE)),\"\")","v":5},{"$f":"IF(C113<>\"\",IF(VLOOKUP(C113,Reference!$M$3:$Q$188,5,FALSE)=\" \",0,VLOOKUP(C113,Reference!$M$3:$Q$188,5,FALSE)),\"\")","v":0},""]
[null,null,"Hexachlorobutadiene",null,null,null,null,null,null,null,null,null,"<",null,null,null,null,null,null,{"$f":"IF(C114<>\"\",IF(VLOOKUP(C114,Reference!$A$3:$B$188,2,FALSE)=\"\",\"N/A\",VLOOKUP(C114,Reference!$A$3:$B$188,2,FALSE)),\"\")","v":0.44},null,null,null,"",null,null,null,null,null,null,null,null,"",null,null,null,null,null,null,{"$f":"IF(C114<>\"\",IF(VLOOKUP(C114,Reference!$I$3:$J$188,2,FALSE)=\" \",0,VLOOKUP(C114,Reference!$I$3:$J$188,2,FALSE)),\"\")","v":0.5},{"$f":"IF(C114<>\"\",IF(VLOOKUP(C114,Reference!$M$3:$Q$188,5,FALSE)=\" \",0,VLOOKUP(C114,Reference!$M$3:$Q$188,5,FALSE)),\"\")","v":0},""]
[null,null,"Hexachlorocyclopentadiene",null,null,null,null,null,null,null,null,null,"<",null,null,null,null,null,null,{"$f":"IF(C115<>\"\",IF(VLOOKUP(C115,Reference!$A$3:$B$188,2,FALSE)=\"\",\"N/A\",VLOOKUP(C115,Reference!$A$3:$B$188,2,FALSE)),\"\")","v":1},null,null,null,"",null,null,null,null,null,null,null,null,"",null,null,null,null,null,null,{"$f":"IF(C115<>\"\",IF(VLOOKUP(C115,Reference!$I$3:$J$188,2,FALSE)=\" \",0,VLOOKUP(C115,Reference!$I$3:$J$188,2,FALSE)),\"\")","v":5},{"$f":"IF(C115<>\"\",IF(VLOOKUP(C115,Reference!$M$3:$Q$188,5,FALSE)=\" \",0,VLOOKUP(C115,Reference!$M$3:$Q$188,5,FALSE)),\"\")","v":0},""]
[null,null,"Hexachloroethane",null,null,null,null,null,null,null,null,null,"<",null,null,null,null,null,null,{"$f":"IF(C116<>\"\",IF(VLOOKUP(C116,Reference!$A$3:$B$188,2,FALSE)=\"\",\"N/A\",VLOOKUP(C116,Reference!$A$3:$B$188,2,FALSE)),\"\")","v":1.4},null,null,null,"",null,null,null,null,null,null,null,null,"",null,null,null,null,null,null,{"$f":"IF(C116<>\"\",IF(VLOOKUP(C116,Reference!$I$3:$J$188,2,FALSE)=\" \",0,VLOOKUP(C116,Reference!$I$3:$J$188,2,FALSE)),\"\")","v":5},{"$f":"IF(C116<>\"\",IF(VLOOKUP(C116,Reference!$M$3:$Q$188,5,FALSE)=\" \",0,VLOOKUP(C116,Reference!$M$3:$Q$188,5,FALSE)),\"\")","v":0},""]
[null,null,"Indeno(1,2,3-cd)Pyrene",null,null,null,null,null,null,null,null,null,"<",null,null,null,null,null,null,{"$f":"IF(C117<>\"\",IF(VLOOKUP(C117,Reference!$A$3:$B$188,2,FALSE)=\"\",\"N/A\",VLOOKUP(C117,Reference!$A$3:$B$188,2,FALSE)),\"\")","v":3.8E-3},null,null,null,"",null,null,null,null,null,null,null,null,"",null,null,null,null,null,null,{"$f":"IF(C117<>\"\",IF(VLOOKUP(C117,Reference!$I$3:$J$188,2,FALSE)=\" \",0,VLOOKUP(C117,Reference!$I$3:$J$188,2,FALSE)),\"\")","v":2.5},{"$f":"IF(C117<>\"\",IF(VLOOKUP(C117,Reference!$M$3:$Q$188,5,FALSE)=\" \",0,VLOOKUP(C117,Reference!$M$3:$Q$188,5,FALSE)),\"\")","v":0},""]
[null,null,"Isophorone",null,null,null,null,null,null,null,null,null,"<",null,null,null,null,null,null,{"$f":"IF(C118<>\"\",IF(VLOOKUP(C118,Reference!$A$3:$B$188,2,FALSE)=\"\",\"N/A\",VLOOKUP(C118,Reference!$A$3:$B$188,2,FALSE)),\"\")","v":35},null,null,null,"",null,null,null,null,null,null,null,null,"",null,null,null,null,null,null,{"$f":"IF(C118<>\"\",IF(VLOOKUP(C118,Reference!$I$3:$J$188,2,FALSE)=\" \",0,VLOOKUP(C118,Reference!$I$3:$J$188,2,FALSE)),\"\")","v":5},{"$f":"IF(C118<>\"\",IF(VLOOKUP(C118,Reference!$M$3:$Q$188,5,FALSE)=\" \",0,VLOOKUP(C118,Reference!$M$3:$Q$188,5,FALSE)),\"\")","v":0},""]
[null,null,"Naphthalene",null,null,null,null,null,null,null,null,null,"<",null,null,null,null,null,null,{"$f":"IF(C119<>\"\",IF(VLOOKUP(C119,Reference!$A$3:$B$188,2,FALSE)=\"\",\"N/A\",VLOOKUP(C119,Reference!$A$3:$B$188,2,FALSE)),\"\")","v":43},null,null,null,"",null,null,null,null,null,null,null,null,"",null,null,null,null,null,null,{"$f":"IF(C119<>\"\",IF(VLOOKUP(C119,Reference!$I$3:$J$188,2,FALSE)=\" \",0,VLOOKUP(C119,Reference!$I$3:$J$188,2,FALSE)),\"\")","v":0.5},{"$f":"IF(C119<>\"\",IF(VLOOKUP(C119,Reference!$M$3:$Q$188,5,FALSE)=\" \",0,VLOOKUP(C119,Reference!$M$3:$Q$188,5,FALSE)),\"\")","v":0},""]
[null,null,"Nitrobenzene",null,null,null,null,null,null,null,null,null,"<",null,null,null,null,null,null,{"$f":"IF(C120<>\"\",IF(VLOOKUP(C120,Reference!$A$3:$B$188,2,FALSE)=\"\",\"N/A\",VLOOKUP(C120,Reference!$A$3:$B$188,2,FALSE)),\"\")","v":17},null,null,null,"",null,null,null,null,null,null,null,null,"",null,null,null,null,null,null,{"$f":"IF(C120<>\"\",IF(VLOOKUP(C120,Reference!$I$3:$J$188,2,FALSE)=\" \",0,VLOOKUP(C120,Reference!$I$3:$J$188,2,FALSE)),\"\")","v":5},{"$f":"IF(C120<>\"\",IF(VLOOKUP(C120,Reference!$M$3:$Q$188,5,FALSE)=\" \",0,VLOOKUP(C120,Reference!$M$3:$Q$188,5,FALSE)),\"\")","v":0},""]
[null,null,"n-Nitrosodimethylamine",null,null,null,null,null,null,null,null,null,"<",null,null,null,null,null,null,{"$f":"IF(C121<>\"\",IF(VLOOKUP(C121,Reference!$A$3:$B$188,2,FALSE)=\"\",\"N/A\",VLOOKUP(C121,Reference!$A$3:$B$188,2,FALSE)),\"\")","v":6.8999999999999997E-4},null,null,null,"",null,null,null,null,null,null,null,null,"",null,null,null,null,null,null,{"$f":"IF(C121<>\"\",IF(VLOOKUP(C121,Reference!$I$3:$J$188,2,FALSE)=\" \",0,VLOOKUP(C121,Reference!$I$3:$J$188,2,FALSE)),\"\")","v":5},{"$f":"IF(C121<>\"\",IF(VLOOKUP(C121,Reference!$M$3:$Q$188,5,FALSE)=\" \",0,VLOOKUP(C121,Reference!$M$3:$Q$188,5,FALSE)),\"\")","v":0},""]
[null,null,"n-Nitrosodi-n-Propylamine",null,null,null,null,null,null,null,null,null,"<",null,null,null,null,null,null,{"$f":"IF(C122<>\"\",IF(VLOOKUP(C122,Reference!$A$3:$B$188,2,FALSE)=\"\",\"N/A\",VLOOKUP(C122,Reference!$A$3:$B$188,2,FALSE)),\"\")","v":5.0000000000000001E-3},null,null,null,"",null,null,null,null,null,null,null,null,"",null,null,null,null,null,null,{"$f":"IF(C122<>\"\",IF(VLOOKUP(C122,Reference!$I$3:$J$188,2,FALSE)=\" \",0,VLOOKUP(C122,Reference!$I$3:$J$188,2,FALSE)),\"\")","v":5},{"$f":"IF(C122<>\"\",IF(VLOOKUP(C122,Reference!$M$3:$Q$188,5,FALSE)=\" \",0,VLOOKUP(C122,Reference!$M$3:$Q$188,5,FALSE)),\"\")","v":0},""]
[null,null,"n-Nitrosodiphenylamine",null,null,null,null,null,null,null,null,null,"<",null,null,null,null,null,null,{"$f":"IF(C123<>\"\",IF(VLOOKUP(C123,Reference!$A$3:$B$188,2,FALSE)=\"\",\"N/A\",VLOOKUP(C123,Reference!$A$3:$B$188,2,FALSE)),\"\")","v":3.3},null,null,null,"",null,null,null,null,null,null,null,null,"",null,null,null,null,null,null,{"$f":"IF(C123<>\"\",IF(VLOOKUP(C123,Reference!$I$3:$J$188,2,FALSE)=\" \",0,VLOOKUP(C123,Reference!$I$3:$J$188,2,FALSE)),\"\")","v":5},{"$f":"IF(C123<>\"\",IF(VLOOKUP(C123,Reference!$M$3:$Q$188,5,FALSE)=\" \",0,VLOOKUP(C123,Reference!$M$3:$Q$188,5,FALSE)),\"\")","v":0},""]
[null,null,"Phenanthrene",null,null,null,null,null,null,null,null,null,"<",null,null,null,null,null,null,{"$f":"IF(C124<>\"\",IF(VLOOKUP(C124,Reference!$A$3:$B$188,2,FALSE)=\"\",\"N/A\",VLOOKUP(C124,Reference!$A$3:$B$188,2,FALSE)),\"\")","v":1},null,null,null,"",null,null,null,null,null,null,null,null,"",null,null,null,null,null,null,{"$f":"IF(C124<>\"\",IF(VLOOKUP(C124,Reference!$I$3:$J$188,2,FALSE)=\" \",0,VLOOKUP(C124,Reference!$I$3:$J$188,2,FALSE)),\"\")","v":2.5},{"$f":"IF(C124<>\"\",IF(VLOOKUP(C124,Reference!$M$3:$Q$188,5,FALSE)=\" \",0,VLOOKUP(C124,Reference!$M$3:$Q$188,5,FALSE)),\"\")","v":0},""]
[null,null,"Pyrene",null,null,null,null,null,null,null,null,null,"<",null,null,null,null,null,null,{"$f":"IF(C125<>\"\",IF(VLOOKUP(C125,Reference!$A$3:$B$188,2,FALSE)=\"\",\"N/A\",VLOOKUP(C125,Reference!$A$3:$B$188,2,FALSE)),\"\")","v":830},null,null,null,"",null,null,null,null,null,null,null,null,"",null,null,null,null,null,null,{"$f":"IF(C125<>\"\",IF(VLOOKUP(C125,Reference!$I$3:$J$188,2,FALSE)=\" \",0,VLOOKUP(C125,Reference!$I$3:$J$188,2,FALSE)),\"\")","v":2.5},{"$f":"IF(C125<>\"\",IF(VLOOKUP(C125,Reference!$M$3:$Q$188,5,FALSE)=\" \",0,VLOOKUP(C125,Reference!$M$3:$Q$188,5,FALSE)),\"\")","v":0},""]
[null,null,"1,2,4-Trichlorobenzene",null,null,null,null,null,null,null,null,null,"<",null,null,null,null,null,null,{"$f":"IF(C126<>\"\",IF(VLOOKUP(C126,Reference!$A$3:$B$188,2,FALSE)=\"\",\"N/A\",VLOOKUP(C126,Reference!$A$3:$B$188,2,FALSE)),\"\")","v":26},null,null,null,"",null,null,null,null,null,null,null,null,"",null,null,null,null,null,null,{"$f":"IF(C126<>\"\",IF(VLOOKUP(C126,Reference!$I$3:$J$188,2,FALSE)=\" \",0,VLOOKUP(C126,Reference!$I$3:$J$188,2,FALSE)),\"\")","v":0.5},{"$f":"IF(C126<>\"\",IF(VLOOKUP(C126,Reference!$M$3:$Q$188,5,FALSE)=\" \",0,VLOOKUP(C126,Reference!$M$3:$Q$188,5,FALSE)),\"\")","v":0},""]
[null,"Group 6","Aldrin",null,null,null,null,null,null,null,null,null,"<",null,null,null,null,null,null,{"$f":"IF(C127<>\"\",IF(VLOOKUP(C127,Reference!$A$3:$B$188,2,FALSE)=\"\",\"N/A\",VLOOKUP(C127,Reference!$A$3:$B$188,2,FALSE)),\"\")","v":4.9000000000000005E-5},null,null,null,"",null,null,null,null,null,null,null,null,"",null,null,null,null,null,null,{"$f":"IF(C127<>\"\",IF(VLOOKUP(C127,Reference!$I$3:$J$188,2,FALSE)=\" \",0,VLOOKUP(C127,Reference!$I$3:$J$188,2,FALSE)),\"\")","v":0.05},{"$f":"IF(C127<>\"\",IF(VLOOKUP(C127,Reference!$M$3:$Q$188,5,FALSE)=\" \",0,VLOOKUP(C127,Reference!$M$3:$Q$188,5,FALSE)),\"\")","v":0},""]
[null,null,"alpha-BHC",null,null,null,null,null,null,null,null,null,"<",null,null,null,null,null,null,{"$f":"IF(C128<>\"\",IF(VLOOKUP(C128,Reference!$A$3:$B$188,2,FALSE)=\"\",\"N/A\",VLOOKUP(C128,Reference!$A$3:$B$188,2,FALSE)),\"\")","v":2.5999999999999999E-3},null,null,null,"",null,null,null,null,null,null,null,null,"",null,null,null,null,null,null,{"$f":"IF(C128<>\"\",IF(VLOOKUP(C128,Reference!$I$3:$J$188,2,FALSE)=\" \",0,VLOOKUP(C128,Reference!$I$3:$J$188,2,FALSE)),\"\")","v":0.05},{"$f":"IF(C128<>\"\",IF(VLOOKUP(C128,Reference!$M$3:$Q$188,5,FALSE)=\" \",0,VLOOKUP(C128,Reference!$M$3:$Q$188,5,FALSE)),\"\")","v":0},""]
[null,null,"beta-BHC",null,null,null,null,null,null,null,null,null,"<",null,null,null,null,null,null,{"$f":"IF(C129<>\"\",IF(VLOOKUP(C129,Reference!$A$3:$B$188,2,FALSE)=\"\",\"N/A\",VLOOKUP(C129,Reference!$A$3:$B$188,2,FALSE)),\"\")","v":9.0999999999999987E-3},null,null,null,"",null,null,null,null,null,null,null,null,"",null,null,null,null,null,null,{"$f":"IF(C129<>\"\",IF(VLOOKUP(C129,Reference!$I$3:$J$188,2,FALSE)=\" \",0,VLOOKUP(C129,Reference!$I$3:$J$188,2,FALSE)),\"\")","v":0.05},{"$f":"IF(C129<>\"\",IF(VLOOKUP(C129,Reference!$M$3:$Q$188,5,FALSE)=\" \",0,VLOOKUP(C129,Reference!$M$3:$Q$188,5,FALSE)),\"\")","v":0},""]
[null,null,"gamma-BHC",null,null,null,null,null,null,null,null,null,"<",null,null,null,null,null,null,{"$f":"IF(C130<>\"\",IF(VLOOKUP(C130,Reference!$A$3:$B$188,2,FALSE)=\"\",\"N/A\",VLOOKUP(C130,Reference!$A$3:$B$188,2,FALSE)),\"\")","v":9.8000000000000004E-2},null,null,null,"",null,null,null,null,null,null,null,null,"",null,null,null,null,null,null,{"$f":"IF(C130<>\"\",IF(VLOOKUP(C130,Reference!$I$3:$J$188,2,FALSE)=\" \",0,VLOOKUP(C130,Reference!$I$3:$J$188,2,FALSE)),\"\")","v":0.05},{"$f":"IF(C130<>\"\",IF(VLOOKUP(C130,Reference!$M$3:$Q$188,5,FALSE)=\" \",0,VLOOKUP(C130,Reference!$M$3:$Q$188,5,FALSE)),\"\")","v":0},""]
[null,null,"delta BHC",null,null,null,null,null,null,null,null,null,"<",null,null,null,null,null,null,{"$f":"IF(C131<>\"\",IF(VLOOKUP(C131,Reference!$A$3:$B$188,2,FALSE)=\"\",\"N/A\",VLOOKUP(C131,Reference!$A$3:$B$188,2,FALSE)),\"\")","v":"N/A"},null,null,null,"",null,null,null,null,null,null,null,null,"",null,null,null,null,null,null,{"$f":"IF(C131<>\"\",IF(VLOOKUP(C131,Reference!$I$3:$J$188,2,FALSE)=\" \",0,VLOOKUP(C131,Reference!$I$3:$J$188,2,FALSE)),\"\")","v":0.05},{"$f":"IF(C131<>\"\",IF(VLOOKUP(C131,Reference!$M$3:$Q$188,5,FALSE)=\" \",0,VLOOKUP(C131,Reference!$M$3:$Q$188,5,FALSE)),\"\")","v":0},""]
[null,null,"Chlordane",null,null,null,null,null,null,null,null,null,"<",null,null,null,null,null,null,{"$f":"IF(C132<>\"\",IF(VLOOKUP(C132,Reference!$A$3:$B$188,2,FALSE)=\"\",\"N/A\",VLOOKUP(C132,Reference!$A$3:$B$188,2,FALSE)),\"\")","v":7.9999999999999993E-4},null,null,null,"",null,null,null,null,null,null,null,null,"",null,null,null,null,null,null,{"$f":"IF(C132<>\"\",IF(VLOOKUP(C132,Reference!$I$3:$J$188,2,FALSE)=\" \",0,VLOOKUP(C132,Reference!$I$3:$J$188,2,FALSE)),\"\")","v":1},{"$f":"IF(C132<>\"\",IF(VLOOKUP(C132,Reference!$M$3:$Q$188,5,FALSE)=\" \",0,VLOOKUP(C132,Reference!$M$3:$Q$188,5,FALSE)),\"\")","v":0},""]
[null,null,"4,4-DDT",null,null,null,null,null,null,null,null,null,"<",null,null,null,null,null,null,{"$f":"IF(C133<>\"\",IF(VLOOKUP(C133,Reference!$A$3:$B$188,2,FALSE)=\"\",\"N/A\",VLOOKUP(C133,Reference!$A$3:$B$188,2,FALSE)),\"\")","v":2.2000000000000001E-4},null,null,null,"",null,null,null,null,null,null,null,null,"",null,null,null,null,null,null,{"$f":"IF(C133<>\"\",IF(VLOOKUP(C133,Reference!$I$3:$J$188,2,FALSE)=\" \",0,VLOOKUP(C133,Reference!$I$3:$J$188,2,FALSE)),\"\")","v":0.05},{"$f":"IF(C133<>\"\",IF(VLOOKUP(C133,Reference!$M$3:$Q$188,5,FALSE)=\" \",0,VLOOKUP(C133,Reference!$M$3:$Q$188,5,FALSE)),\"\")","v":0},""]
[null,null,"4,4-DDE",null,null,null,null,null,null,null,null,null,"<",null,null,null,null,null,null,{"$f":"IF(C134<>\"\",IF(VLOOKUP(C134,Reference!$A$3:$B$188,2,FALSE)=\"\",\"N/A\",VLOOKUP(C134,Reference!$A$3:$B$188,2,FALSE)),\"\")","v":2.2000000000000001E-4},null,null,null,"",null,null,null,null,null,null,null,null,"",null,null,null,null,null,null,{"$f":"IF(C134<>\"\",IF(VLOOKUP(C134,Reference!$I$3:$J$188,2,FALSE)=\" \",0,VLOOKUP(C134,Reference!$I$3:$J$188,2,FALSE)),\"\")","v":0.05},{"$f":"IF(C134<>\"\",IF(VLOOKUP(C134,Reference!$M$3:$Q$188,5,FALSE)=\" \",0,VLOOKUP(C134,Reference!$M$3:$Q$188,5,FALSE)),\"\")","v":0},""]
[null,null,"4,4-DDD",null,null,null,null,null,null,null,null,null,"<",null,null,null,null,null,null,{"$f":"IF(C135<>\"\",IF(VLOOKUP(C135,Reference!$A$3:$B$188,2,FALSE)=\"\",\"N/A\",VLOOKUP(C135,Reference!$A$3:$B$188,2,FALSE)),\"\")","v":3.1E-4},null,null,null,"",null,null,null,null,null,null,null,null,"",null,null,null,null,null,null,{"$f":"IF(C135<>\"\",IF(VLOOKUP(C135,Reference!$I$3:$J$188,2,FALSE)=\" \",0,VLOOKUP(C135,Reference!$I$3:$J$188,2,FALSE)),\"\")","v":0.05},{"$f":"IF(C135<>\"\",IF(VLOOKUP(C135,Reference!$M$3:$Q$188,5,FALSE)=\" \",0,VLOOKUP(C135,Reference!$M$3:$Q$188,5,FALSE)),\"\")","v":0},""]
[null,null,"Dieldrin",null,null,null,null,null,null,null,null,null,"<",null,null,null,null,null,null,{"$f":"IF(C136<>\"\",IF(VLOOKUP(C136,Reference!$A$3:$B$188,2,FALSE)=\"\",\"N/A\",VLOOKUP(C136,Reference!$A$3:$B$188,2,FALSE)),\"\")","v":5.2000000000000004E-5},null,null,null,"",null,null,null,null,null,null,null,null,"",null,null,null,null,null,null,{"$f":"IF(C136<>\"\",IF(VLOOKUP(C136,Reference!$I$3:$J$188,2,FALSE)=\" \",0,VLOOKUP(C136,Reference!$I$3:$J$188,2,FALSE)),\"\")","v":0.05},{"$f":"IF(C136<>\"\",IF(VLOOKUP(C136,Reference!$M$3:$Q$188,5,FALSE)=\" \",0,VLOOKUP(C136,Reference!$M$3:$Q$188,5,FALSE)),\"\")","v":0},""]
[null,null,"alpha-Endosulfan",null,null,null,null,null,null,null,null,null,"<",null,null,null,null,null,null,{"$f":"IF(C137<>\"\",IF(VLOOKUP(C137,Reference!$A$3:$B$188,2,FALSE)=\"\",\"N/A\",VLOOKUP(C137,Reference!$A$3:$B$188,2,FALSE)),\"\")","v":5.6000000000000001E-2},null,null,null,"",null,null,null,null,null,null,null,null,"",null,null,null,null,null,null,{"$f":"IF(C137<>\"\",IF(VLOOKUP(C137,Reference!$I$3:$J$188,2,FALSE)=\" \",0,VLOOKUP(C137,Reference!$I$3:$J$188,2,FALSE)),\"\")","v":0.05},{"$f":"IF(C137<>\"\",IF(VLOOKUP(C137,Reference!$M$3:$Q$188,5,FALSE)=\" \",0,VLOOKUP(C137,Reference!$M$3:$Q$188,5,FALSE)),\"\")","v":0},""]
[null,null,"beta-Endosulfan",null,null,null,null,null,null,null,null,null,"<",null,null,null,null,null,null,{"$f":"IF(C138<>\"\",IF(VLOOKUP(C138,Reference!$A$3:$B$188,2,FALSE)=\"\",\"N/A\",VLOOKUP(C138,Reference!$A$3:$B$188,2,FALSE)),\"\")","v":5.6000000000000001E-2},null,null,null,"",null,null,null,null,null,null,null,null,"",null,null,null,null,null,null,{"$f":"IF(C138<>\"\",IF(VLOOKUP(C138,Reference!$I$3:$J$188,2,FALSE)=\" \",0,VLOOKUP(C138,Reference!$I$3:$J$188,2,FALSE)),\"\")","v":0.05},{"$f":"IF(C138<>\"\",IF(VLOOKUP(C138,Reference!$M$3:$Q$188,5,FALSE)=\" \",0,VLOOKUP(C138,Reference!$M$3:$Q$188,5,FALSE)),\"\")","v":0},""]
[null,null,"Endosulfan Sulfate",null,null,null,null,null,null,null,null,null,"<",null,null,null,null,null,null,{"$f":"IF(C139<>\"\",IF(VLOOKUP(C139,Reference!$A$3:$B$188,2,FALSE)=\"\",\"N/A\",VLOOKUP(C139,Reference!$A$3:$B$188,2,FALSE)),\"\")","v":"N/A"},null,null,null,"",null,null,null,null,null,null,null,null,"",null,null,null,null,null,null,{"$f":"IF(C139<>\"\",IF(VLOOKUP(C139,Reference!$I$3:$J$188,2,FALSE)=\" \",0,VLOOKUP(C139,Reference!$I$3:$J$188,2,FALSE)),\"\")","v":0.05},{"$f":"IF(C139<>\"\",IF(VLOOKUP(C139,Reference!$M$3:$Q$188,5,FALSE)=\" \",0,VLOOKUP(C139,Reference!$M$3:$Q$188,5,FALSE)),\"\")","v":0},""]
[null,null,"Endrin",null,null,null,null,null,null,null,null,null,"<",null,null,null,null,null,null,{"$f":"IF(C140<>\"\",IF(VLOOKUP(C140,Reference!$A$3:$B$188,2,FALSE)=\"\",\"N/A\",VLOOKUP(C140,Reference!$A$3:$B$188,2,FALSE)),\"\")","v":3.6000000000000004E-2},null,null,null,"",null,null,null,null,null,null,null,null,"",null,null,null,null,null,null,{"$f":"IF(C140<>\"\",IF(VLOOKUP(C140,Reference!$I$3:$J$188,2,FALSE)=\" \",0,VLOOKUP(C140,Reference!$I$3:$J$188,2,FALSE)),\"\")","v":0.05},{"$f":"IF(C140<>\"\",IF(VLOOKUP(C140,Reference!$M$3:$Q$188,5,FALSE)=\" \",0,VLOOKUP(C140,Reference!$M$3:$Q$188,5,FALSE)),\"\")","v":0},""]
[null,null,"Endrin Aldehyde",null,null,null,null,null,null,null,null,null,"<",null,null,null,null,null,null,{"$f":"IF(C141<>\"\",IF(VLOOKUP(C141,Reference!$A$3:$B$188,2,FALSE)=\"\",\"N/A\",VLOOKUP(C141,Reference!$A$3:$B$188,2,FALSE)),\"\")","v":0.28999999999999998},null,null,null,"",null,null,null,null,null,null,null,null,"",null,null,null,null,null,null,{"$f":"IF(C141<>\"\",IF(VLOOKUP(C141,Reference!$I$3:$J$188,2,FALSE)=\" \",0,VLOOKUP(C141,Reference!$I$3:$J$188,2,FALSE)),\"\")","v":0.05},{"$f":"IF(C141<>\"\",IF(VLOOKUP(C141,Reference!$M$3:$Q$188,5,FALSE)=\" \",0,VLOOKUP(C141,Reference!$M$3:$Q$188,5,FALSE)),\"\")","v":0},""]
[null,null,"Heptachlor",null,null,null,null,null,null,null,null,null,"<",null,null,null,null,null,null,{"$f":"IF(C142<>\"\",IF(VLOOKUP(C142,Reference!$A$3:$B$188,2,FALSE)=\"\",\"N/A\",VLOOKUP(C142,Reference!$A$3:$B$188,2,FALSE)),\"\")","v":7.9000000000000009E-5},null,null,null,"",null,null,null,null,null,null,null,null,"",null,null,null,null,null,null,{"$f":"IF(C142<>\"\",IF(VLOOKUP(C142,Reference!$I$3:$J$188,2,FALSE)=\" \",0,VLOOKUP(C142,Reference!$I$3:$J$188,2,FALSE)),\"\")","v":0.05},{"$f":"IF(C142<>\"\",IF(VLOOKUP(C142,Reference!$M$3:$Q$188,5,FALSE)=\" \",0,VLOOKUP(C142,Reference!$M$3:$Q$188,5,FALSE)),\"\")","v":0},""]
[null,null,"Heptachlor Epoxide",null,null,null,null,null,null,null,null,null,"<",null,null,null,null,null,null,{"$f":"IF(C143<>\"\",IF(VLOOKUP(C143,Reference!$A$3:$B$188,2,FALSE)=\"\",\"N/A\",VLOOKUP(C143,Reference!$A$3:$B$188,2,FALSE)),\"\")","v":3.8999999999999999E-5},null,null,null,"",null,null,null,null,null,null,null,null,"",null,null,null,null,null,null,{"$f":"IF(C143<>\"\",IF(VLOOKUP(C143,Reference!$I$3:$J$188,2,FALSE)=\" \",0,VLOOKUP(C143,Reference!$I$3:$J$188,2,FALSE)),\"\")","v":0.05},{"$f":"IF(C143<>\"\",IF(VLOOKUP(C143,Reference!$M$3:$Q$188,5,FALSE)=\" \",0,VLOOKUP(C143,Reference!$M$3:$Q$188,5,FALSE)),\"\")","v":0},""]
[null,null,"Toxaphene",null,null,null,null,null,null,null,null,null,"<",null,null,null,null,null,null,{"$f":"IF(C144<>\"\",IF(VLOOKUP(C144,Reference!$A$3:$B$188,2,FALSE)=\"\",\"N/A\",VLOOKUP(C144,Reference!$A$3:$B$188,2,FALSE)),\"\")","v":1.9999999999999998E-4},null,null,null,"",null,null,null,null,null,null,null,null,"",null,null,null,null,null,null,{"$f":"IF(C144<>\"\",IF(VLOOKUP(C144,Reference!$I$3:$J$188,2,FALSE)=\" \",0,VLOOKUP(C144,Reference!$I$3:$J$188,2,FALSE)),\"\")","v":0.5},{"$f":"IF(C144<>\"\",IF(VLOOKUP(C144,Reference!$M$3:$Q$188,5,FALSE)=\" \",0,VLOOKUP(C144,Reference!$M$3:$Q$188,5,FALSE)),\"\")","v":0},""]
[null,null,"2,3,7,8-TCDD",null,null,null,null,null,null,null,null,null,"<",null,null,null,null,null,null,{"$f":"IF(C145<>\"\",IF(VLOOKUP(C145,Reference!$A$3:$B$188,2,FALSE)=\"\",\"N/A\",VLOOKUP(C145,Reference!$A$3:$B$188,2,FALSE)),\"\")","v":5.0000000000000001E-9},null,null,null,"",null,null,null,null,null,null,null,null,"",null,null,null,null,null,null,{"$f":"IF(C145<>\"\",IF(VLOOKUP(C145,Reference!$I$3:$J$188,2,FALSE)=\" \",0,VLOOKUP(C145,Reference!$I$3:$J$188,2,FALSE)),\"\")","v":5.0000000000000004E-6},{"$f":"IF(C145<>\"\",IF(VLOOKUP(C145,Reference!$M$3:$Q$188,5,FALSE)=\" \",0,VLOOKUP(C145,Reference!$M$3:$Q$188,5,FALSE)),\"\")","v":0},""]
[null,"Group 7","Gross Alpha (pCi/L)",null,null,null,null,null,null,null,null,null,"<",null,null,null,null,null,null,{"$f":"IF(C146<>\"\",IF(VLOOKUP(C146,Reference!$A$3:$B$188,2,FALSE)=\"\",\"N/A\",VLOOKUP(C146,Reference!$A$3:$B$188,2,FALSE)),\"\")","v":"N/A"},null,null,null,"",null,null,null,null,null,null,null,null,"",null,null,null,null,null,null,{"$f":"IF(C146<>\"\",IF(VLOOKUP(C146,Reference!$I$3:$J$188,2,FALSE)=\" \",0,VLOOKUP(C146,Reference!$I$3:$J$188,2,FALSE)),\"\")","v":3},{"$f":"IF(C146<>\"\",IF(VLOOKUP(C146,Reference!$M$3:$Q$188,5,FALSE)=\" \",0,VLOOKUP(C146,Reference!$M$3:$Q$188,5,FALSE)),\"\")","v":0},""]
[null,null,"Total Beta (pCi/L)",null,null,null,null,null,null,null,null,null,"<",null,null,null,null,null,null,{"$f":"IF(C147<>\"\",IF(VLOOKUP(C147,Reference!$A$3:$B$188,2,FALSE)=\"\",\"N/A\",VLOOKUP(C147,Reference!$A$3:$B$188,2,FALSE)),\"\")","v":"N/A"},null,null,null,{"$f":"IF(AND(C147<>\"\",N147<>\"\",$J$8<>\"\",$Z$7<>\"\"),IF(T147<>\"N/A\",IF(AND(N147<=VALUE(AN147),M147=\"<\"),\"No (Value < QL)\",IF($AP$9=\"No\",IF(N147>=(0.5*T147),IF(AND(M147=\"<\",N147=(0.5*T147)),\"No\",\"Yes\"),\"No\"),IF(N147>=T147,IF(AND(M147=\"<\",N147=T147),\"No\",\"Yes\"),\"No\"))),\"No\"),\"\")","v":""},null,null,null,null,null,null,null,null,"",null,null,null,null,null,null,{"$f":"IF(C147<>\"\",IF(VLOOKUP(C147,Reference!$I$3:$J$188,2,FALSE)=\" \",0,VLOOKUP(C147,Reference!$I$3:$J$188,2,FALSE)),\"\")","v":4},{"$f":"IF(C147<>\"\",IF(VLOOKUP(C147,Reference!$M$3:$Q$188,5,FALSE)=\" \",0,VLOOKUP(C147,Reference!$M$3:$Q$188,5,FALSE)),\"\")","v":0},{"$f":"IF(AND(X147=\"Yes\",AC147<>\"\"),IF((N147/AC147)>=0.5,\"Establish Limits\",IF(AND(AO147=\"Y\",(N147/AC147)>0.1),\"Monitor\",IF(AND(AO147<>\"Y\",(N147/AC147)>0.25),\"Monitor\",\"No Limits/Monitoring\"))),\"\")","v":""}]
[null,null,"Radium 226/228 (pCi/L)",null,null,null,null,null,null,null,null,null,"<",null,null,null,null,null,null,{"$f":"IF(C148<>\"\",IF(VLOOKUP(C148,Reference!$A$3:$B$188,2,FALSE)=\"\",\"N/A\",VLOOKUP(C148,Reference!$A$3:$B$188,2,FALSE)),\"\")","v":"N/A"},null,null,null,"",null,null,null,null,null,null,null,null,"",null,null,null,null,null,null,{"$f":"IF(C148<>\"\",IF(VLOOKUP(C148,Reference!$I$3:$J$188,2,FALSE)=\" \",0,VLOOKUP(C148,Reference!$I$3:$J$188,2,FALSE)),\"\")","v":1},{"$f":"IF(C148<>\"\",IF(VLOOKUP(C148,Reference!$M$3:$Q$188,5,FALSE)=\" \",0,VLOOKUP(C148,Reference!$M$3:$Q$188,5,FALSE)),\"\")","v":0},""]
[null,null,"Total Strontium",null,null,null,null,null,null,null,null,null,"<",null,null,null,null,null,null,{"$f":"IF(C149<>\"\",IF(VLOOKUP(C149,Reference!$A$3:$B$188,2,FALSE)=\"\",\"N/A\",VLOOKUP(C149,Reference!$A$3:$B$188,2,FALSE)),\"\")","v":4000},null,null,null,"",null,null,null,null,null,null,null,null,"",null,null,null,null,null,null,{"$f":"IF(C149<>\"\",IF(VLOOKUP(C149,Reference!$I$3:$J$188,2,FALSE)=\" \",0,VLOOKUP(C149,Reference!$I$3:$J$188,2,FALSE)),\"\")","v":10},{"$f":"IF(C149<>\"\",IF(VLOOKUP(C149,Reference!$M$3:$Q$188,5,FALSE)=\" \",0,VLOOKUP(C149,Reference!$M$3:$Q$188,5,FALSE)),\"\")","v":"Y"},""]
[null,null,"Total Uranium",null,null,null,null,null,null,null,null,null,"<",null,null,null,null,null,null,{"$f":"IF(C150<>\"\",IF(VLOOKUP(C150,Reference!$A$3:$B$188,2,FALSE)=\"\",\"N/A\",VLOOKUP(C150,Reference!$A$3:$B$188,2,FALSE)),\"\")","v":"N/A"},null,null,null,"",null,null,null,null,null,null,null,null,{"$f":"IF($N150<>\"\",IF(AND(X150=\"Yes\",AC150<>\"\"),IF(($N150/$AC150)>=0.5,\"Establish Limits\",IF(AND($AO150=\"Y\",($N150/$AC150)>0.1),\"Monitor\",IF(AND($AO150<>\"Y\",($N150/$AC150)>0.25),\"Monitor\",\"No Limits/Monitoring\"))),\"\"),\"\")","v":""},null,null,null,null,null,null,{"$f":"IF(C150<>\"\",IF(VLOOKUP(C150,Reference!$I$3:$J$188,2,FALSE)=\" \",0,VLOOKUP(C150,Reference!$I$3:$J$188,2,FALSE)),\"\")","v":2},{"$f":"IF(C150<>\"\",IF(VLOOKUP(C150,Reference!$M$3:$Q$188,5,FALSE)=\" \",0,VLOOKUP(C150,Reference!$M$3:$Q$188,5,FALSE)),\"\")","v":"Y"},""]
[null,null,null,null,null,null,null,null,null,null,null,null,null,null,null,null,null,null,null,{"$f":"IF(C151<>\"\",IF(VLOOKUP(C151,Reference!$A$3:$B$188,2,FALSE)=\"\",\"N/A\",VLOOKUP(C151,Reference!$A$3:$B$188,2,FALSE)),\"\")","v":""},null,null,null,"",null,null,null,null,null,null,null,null,"",null,null,null,null,null,null,{"$f":"IF(C151<>\"\",IF(VLOOKUP(C151,Reference!$I$3:$J$188,2,FALSE)=\" \",0,VLOOKUP(C151,Reference!$I$3:$J$188,2,FALSE)),\"\")","v":""},{"$f":"IF(C151<>\"\",IF(VLOOKUP(C151,Reference!$M$3:$Q$188,5,FALSE)=\" \",0,VLOOKUP(C151,Reference!$M$3:$Q$188,5,FALSE)),\"\")","v":""},""]
[null,null,null,null,null,null,null,null,null,null,null,null,null,null,null,null,null,null,null,{"$f":"IF(C152<>\"\",IF(VLOOKUP(C152,Reference!$A$3:$B$188,2,FALSE)=\"\",\"N/A\",VLOOKUP(C152,Reference!$A$3:$B$188,2,FALSE)),\"\")","v":""},null,null,null,"",null,null,null,null,null,null,null,null,"",null,null,null,null,null,null,{"$f":"IF(C152<>\"\",IF(VLOOKUP(C152,Reference!$I$3:$J$188,2,FALSE)=\" \",0,VLOOKUP(C152,Reference!$I$3:$J$188,2,FALSE)),\"\")","v":""},{"$f":"IF(C152<>\"\",IF(VLOOKUP(C152,Reference!$M$3:$Q$188,5,FALSE)=\" \",0,VLOOKUP(C152,Reference!$M$3:$Q$188,5,FALSE)),\"\")","v":""},""]
[null,null,null,null,null,null,null,null,null,null,null,null,null,null,null,null,null,null,null,{"$f":"IF(C153<>\"\",IF(VLOOKUP(C153,Reference!$A$3:$B$188,2,FALSE)=\"\",\"N/A\",VLOOKUP(C153,Reference!$A$3:$B$188,2,FALSE)),\"\")","v":""},null,null,null,"",null,null,null,null,null,null,null,null,"",null,null,null,null,null,null,{"$f":"IF(C153<>\"\",IF(VLOOKUP(C153,Reference!$I$3:$J$188,2,FALSE)=\" \",0,VLOOKUP(C153,Reference!$I$3:$J$188,2,FALSE)),\"\")","v":""},{"$f":"IF(C153<>\"\",IF(VLOOKUP(C153,Reference!$M$3:$Q$188,5,FALSE)=\" \",0,VLOOKUP(C153,Reference!$M$3:$Q$188,5,FALSE)),\"\")","v":""},""]
[null,null,null,null,null,null,null,null,null,null,null,null,null,null,null,null,null,null,null,{"$f":"IF(C154<>\"\",IF(VLOOKUP(C154,Reference!$A$3:$B$188,2,FALSE)=\"\",\"N/A\",VLOOKUP(C154,Reference!$A$3:$B$188,2,FALSE)),\"\")","v":""},null,null,null,"",null,null,null,null,null,null,null,null,"",null,null,null,null,null,null,{"$f":"IF(C154<>\"\",IF(VLOOKUP(C154,Reference!$I$3:$J$188,2,FALSE)=\" \",0,VLOOKUP(C154,Reference!$I$3:$J$188,2,FALSE)),\"\")","v":""},{"$f":"IF(C154<>\"\",IF(VLOOKUP(C154,Reference!$M$3:$Q$188,5,FALSE)=\" \",0,VLOOKUP(C154,Reference!$M$3:$Q$188,5,FALSE)),\"\")","v":""},""]
[null,null,null,null,null,null,null,null,null,null,null,null,null,null,null,null,null,null,null,{"$f":"IF(C155<>\"\",IF(VLOOKUP(C155,Reference!$A$3:$B$188,2,FALSE)=\"\",\"N/A\",VLOOKUP(C155,Reference!$A$3:$B$188,2,FALSE)),\"\")","v":""},null,null,null,"",null,null,null,null,null,null,null,null,"",null,null,null,null,null,null,{"$f":"IF(C155<>\"\",IF(VLOOKUP(C155,Reference!$I$3:$J$188,2,FALSE)=\" \",0,VLOOKUP(C155,Reference!$I$3:$J$188,2,FALSE)),\"\")","v":""},{"$f":"IF(C155<>\"\",IF(VLOOKUP(C155,Reference!$M$3:$Q$188,5,FALSE)=\" \",0,VLOOKUP(C155,Reference!$M$3:$Q$188,5,FALSE)),\"\")","v":""},""]
[null,null,null,null,null,null,null,null,null,null,null,null,null,null,null,null,null,null,null,{"$f":"IF(C156<>\"\",IF(VLOOKUP(C156,Reference!$A$3:$B$188,2,FALSE)=\"\",\"N/A\",VLOOKUP(C156,Reference!$A$3:$B$188,2,FALSE)),\"\")","v":""},null,null,null,"",null,null,null,null,null,null,null,null,"",null,null,null,null,null,null,{"$f":"IF(C156<>\"\",IF(VLOOKUP(C156,Reference!$I$3:$J$188,2,FALSE)=\" \",0,VLOOKUP(C156,Reference!$I$3:$J$188,2,FALSE)),\"\")","v":""},{"$f":"IF(C156<>\"\",IF(VLOOKUP(C156,Reference!$M$3:$Q$188,5,FALSE)=\" \",0,VLOOKUP(C156,Reference!$M$3:$Q$188,5,FALSE)),\"\")","v":""},""]
[null,null,null,null,null,null,null,null,null,null,null,null,null,null,null,null,null,null,null,{"$f":"IF(C157<>\"\",IF(VLOOKUP(C157,Reference!$A$3:$B$188,2,FALSE)=\"\",\"N/A\",VLOOKUP(C157,Reference!$A$3:$B$188,2,FALSE)),\"\")","v":""},null,null,null,"",null,null,null,null,null,null,null,null,"",null,null,null,null,null,null,{"$f":"IF(C157<>\"\",IF(VLOOKUP(C157,Reference!$I$3:$J$188,2,FALSE)=\" \",0,VLOOKUP(C157,Reference!$I$3:$J$188,2,FALSE)),\"\")","v":""},{"$f":"IF(C157<>\"\",IF(VLOOKUP(C157,Reference!$M$3:$Q$188,5,FALSE)=\" \",0,VLOOKUP(C157,Reference!$M$3:$Q$188,5,FALSE)),\"\")","v":""},""]
[null,null,null,null,null,null,null,null,null,null,null,null,null,null,null,null,null,null,null,{"$f":"IF(C158<>\"\",IF(VLOOKUP(C158,Reference!$A$3:$B$188,2,FALSE)=\"\",\"N/A\",VLOOKUP(C158,Reference!$A$3:$B$188,2,FALSE)),\"\")","v":""},null,null,null,"",null,null,null,null,null,null,null,null,"",null,null,null,null,null,null,{"$f":"IF(C158<>\"\",IF(VLOOKUP(C158,Reference!$I$3:$J$188,2,FALSE)=\" \",0,VLOOKUP(C158,Reference!$I$3:$J$188,2,FALSE)),\"\")","v":""},{"$f":"IF(C158<>\"\",IF(VLOOKUP(C158,Reference!$M$3:$Q$188,5,FALSE)=\" \",0,VLOOKUP(C158,Reference!$M$3:$Q$188,5,FALSE)),\"\")","v":""},""]
[null,null,null,null,null,null,null,null,null,null,null,null,null,null,null,null,null,null,null,{"$f":"IF(C159<>\"\",IF(VLOOKUP(C159,Reference!$A$3:$B$188,2,FALSE)=\"\",\"N/A\",VLOOKUP(C159,Reference!$A$3:$B$188,2,FALSE)),\"\")","v":""},null,null,null,"",null,null,null,null,null,null,null,null,"",null,null,null,null,null,null,{"$f":"IF(C159<>\"\",IF(VLOOKUP(C159,Reference!$I$3:$J$188,2,FALSE)=\" \",0,VLOOKUP(C159,Reference!$I$3:$J$188,2,FALSE)),\"\")","v":""},{"$f":"IF(C159<>\"\",IF(VLOOKUP(C159,Reference!$M$3:$Q$188,5,FALSE)=\" \",0,VLOOKUP(C159,Reference!$M$3:$Q$188,5,FALSE)),\"\")","v":""},""]
[null,null,null,null,null,null,null,null,null,null,null,null,null,null,null,null,null,null,null,{"$f":"IF(C160<>\"\",IF(VLOOKUP(C160,Reference!$A$3:$B$188,2,FALSE)=\"\",\"N/A\",VLOOKUP(C160,Reference!$A$3:$B$188,2,FALSE)),\"\")","v":""},null,null,null,"",null,null,null,null,null,null,null,null,"",null,null,null,null,null,null,{"$f":"IF(C160<>\"\",IF(VLOOKUP(C160,Reference!$I$3:$J$188,2,FALSE)=\" \",0,VLOOKUP(C160,Reference!$I$3:$J$188,2,FALSE)),\"\")","v":""},{"$f":"IF(C160<>\"\",IF(VLOOKUP(C160,Reference!$M$3:$Q$188,5,FALSE)=\" \",0,VLOOKUP(C160,Reference!$M$3:$Q$188,5,FALSE)),\"\")","v":""},""]
[null,null,null,null,null,null,null,null,null,null,null,null,null,null,null,null,null,null,null,{"$f":"IF(C161<>\"\",IF(VLOOKUP(C161,Reference!$A$3:$B$188,2,FALSE)=\"\",\"N/A\",VLOOKUP(C161,Reference!$A$3:$B$188,2,FALSE)),\"\")","v":""},null,null,null,"",null,null,null,null,null,null,null,null,"",null,null,null,null,null,null,{"$f":"IF(C161<>\"\",IF(VLOOKUP(C161,Reference!$I$3:$J$188,2,FALSE)=\" \",0,VLOOKUP(C161,Reference!$I$3:$J$188,2,FALSE)),\"\")","v":""},{"$f":"IF(C161<>\"\",IF(VLOOKUP(C161,Reference!$M$3:$Q$188,5,FALSE)=\" \",0,VLOOKUP(C161,Reference!$M$3:$Q$188,5,FALSE)),\"\")","v":""},""]
[null,null,null,null,null,null,null,null,null,null,null,null,null,null,null,null,null,null,null,{"$f":"IF(C162<>\"\",IF(VLOOKUP(C162,Reference!$A$3:$B$188,2,FALSE)=\"\",\"N/A\",VLOOKUP(C162,Reference!$A$3:$B$188,2,FALSE)),\"\")","v":""},null,null,null,"",null,null,null,null,null,null,null,null,"",null,null,null,null,null,null,{"$f":"IF(C162<>\"\",IF(VLOOKUP(C162,Reference!$I$3:$J$188,2,FALSE)=\" \",0,VLOOKUP(C162,Reference!$I$3:$J$188,2,FALSE)),\"\")","v":""},{"$f":"IF(C162<>\"\",IF(VLOOKUP(C162,Reference!$M$3:$Q$188,5,FALSE)=\" \",0,VLOOKUP(C162,Reference!$M$3:$Q$188,5,FALSE)),\"\")","v":""},""]

{"sheet":"Industrial","index":2,"n_rows":170,"n_cols":46,"rows_kept":170,"cut":false,"hidden":false,"merged":[[157,13,157,18],[157,19,157,22],[157,23,157,27],[157,28,157,31],[157,32,157,36],[155,13,155,18],[155,19,155,22],[155,23,155,27],[155,28,155,31],[155,32,155,36],[156,2,156,11],[156,13,156,18],[156,19,156,22],[156,23,156,27],[156,28,156,31],[156,32,156,36],[153,13,153,18],[153,19,153,22],[153,23,153,27],[153,28,153,31],[153,32,153,36],[154,2,154,11],[154,13,154,18],[154,19,154,22],[154,23,154,27],[154,28,154,31],[154,32,154,36],[11,1,15,1],[16,1,39,1],[40,1,68,1],[69,1,79,1],[80,1,126,1],[153,1,157,1],[153,2,153,11],[155,2,155,11],[157,2,157,11],[24,2,24,11],[26,2,26,11],[28,2,28,11],[30,2,30,11],[32,2,32,11],[34,2,34,11],[37,2,37,11],[39,2,39,11],[41,2,41,11],[46,2,46,11],[48,2,48,11],[50,2,50,11],[52,2,52,11],[54,2,54,11],[56,2,56,11],[15,32,15,36],[14,28,14,31],[14,32,14,36],[13,19,13,22],[13,23,13,27],[13,28,13,31],[13,32,13,36],[5,35,5,36],[6,9,6,10],[9,2,10,11],[9,12,10,18],[5,15,5,18],[6,11,6,18],[6,25,6,27],[6,28,6,29],[6,30,6,34],[6,35,6,36],[5,25,5,29],[5,30,5,32],[5,19,5,24],[6,19,6,24],[9,19,10,22],[9,23,10,27],[9,28,10,31],[9,32,10,36],[0,0,169,0],[0,2,0,36],[1,2,1,36],[2,2,2,36],[3,2,3,36],[5,2,5,4],[5,5,5,14],[5,33,5,34],[36,2,36,11],[36,13,36,18],[36,19,36,22],[36,23,36,27],[36,28,36,31],[36,32,36,36],[58,2,58,11],[58,13,58,18],[58,19,58,22],[58,23,58,27],[8,2,8,36],[16,2,16,11],[16,13,16,18],[16,19,16,22],[16,23,16,27],[16,28,16,31],[16,32,16,36],[11,32,11,36],[15,2,15,11],[11,2,11,11],[11,13,11,18],[11,19,11,22],[11,23,11,27],[11,28,11,31],[14,2,14,11],[14,13,14,18],[14,19,14,22],[14,23,14,27],[13,2,13,11],[13,13,13,18],[12,2,12,11],[12,13,12,18],[12,19,12,22],[12,23,12,27],[12,28,12,31],[12,32,12,36],[15,13,15,18],[15,19,15,22],[15,23,15,27],[15,28,15,31],[17,32,17,36],[17,2,17,11],[17,13,17,18],[17,19,17,22],[17,23,17,27],[17,28,17,31],[20,2,20,11],[20,13,20,18],[20,19,20,22],[20,23,20,27],[20,28,20,31],[20,32,20,36],[18,28,18,31],[18,32,18,36],[19,2,19,11],[19,13,19,18],[19,19,19,22],[19,23,19,27],[19,28,19,31],[19,32,19,36],[18,2,18,11],[18,13,18,18],[18,19,18,22],[18,23,18,27],[22,2,22,11],[22,13,22,18],[22,19,22,22],[22,23,22,27],[22,28,22,31],[22,32,22,36],[21,2,21,11],[21,13,21,18],[21,19,21,22],[21,23,21,27],[21,28,21,31],[21,32,21,36],[24,13,24,18],[24,19,24,22],[24,23,24,27],[24,28,24,31],[24,32,24,36],[23,2,23,11],[23,13,23,18],[23,19,23,22],[23,23,23,27],[23,28,23,31],[23,32,23,36],[26,13,26,18],[26,19,26,22],[26,23,26,27],[26,28,26,31],[26,32,26,36],[25,2,25,11],[25,13,25,18],[25,19,25,22],[25,23,25,27],[25,28,25,31],[25,32,25,36],[28,13,28,18],[28,19,28,22],[28,23,28,27],[28,28,28,31],[28,32,28,36],[27,2,27,11],[27,13,27,18],[27,19,27,22],[27,23,27,27],[27,28,27,31],[27,32,27,36],[30,13,30,18],[30,19,30,22],[30,23,30,27],[30,28,30,31],[30,32,30,36],[29,2,29,11],[29,13,29,18],[29,19,29,22],[29,23,29,27],[29,28,29,31],[29,32,29,36],[32,13,32,18],[32,19,32,22],[32,23,32,27],[32,28,32,31],[32,32,32,36],[31,2,31,11],[31,13,31,18],[31,19,31,22],[31,23,31,27],[31,28,31,31],[31,32,31,36],[34,13,34,18],[34,19,34,22],[34,23,34,27],[34,28,34,31],[34,32,34,36],[33,2,33,11],[33,13,33,18],[33,19,33,22],[33,23,33,27],[33,28,33,31],[33,32,33,36],[37,13,37,18],[37,19,37,22],[37,23,37,27],[37,28,37,31],[37,32,37,36],[35,2,35,11],[35,13,35,18],[35,19,35,22],[35,23,35,27],[35,28,35,31],[35,32,35,36],[39,13,39,18],[39,19,39,22],[39,23,39,27],[39,28,39,31],[39,32,39,36],[38,2,38,11],[38,13,38,18],[38,19,38,22],[38,23,38,27],[38,28,38,31],[38,32,38,36],[41,13,41,18],[41,19,41,22],[41,23,41,27],[41,28,41,31],[41,32,41,36],[40,2,40,11],[40,13,40,18],[40,19,40,22],[40,23,40,27],[40,28,40,31],[40,32,40,36],[42,32,42,36],[43,2,43,11],[43,13,43,18],[43,19,43,22],[43,23,43,27],[43,28,43,31],[43,32,43,36],[42,2,42,11],[42,13,42,18],[42,19,42,22],[42,23,42,27],[42,28,42,31],[46,13,46,18],[46,19,46,22],[46,23,46,27],[46,28,46,31],[46,32,46,36],[44,28,44,31],[44,32,44,36],[45,2,45,11],[45,13,45,18],[45,19,45,22],[45,23,45,27],[45,28,45,31],[45,32,45,36],[44,2,44,11],[44,13,44,18],[44,19,44,22],[44,23,44,27],[48,13,48,18],[48,19,48,22],[48,23,48,27],[48,28,48,31],[48,32,48,36],[47,2,47,11],[47,13,47,18],[47,19,47,22],[47,23,47,27],[47,28,47,31],[47,32,47,36],[50,13,50,18],[50,19,50,22],[50,23,50,27],[50,28,50,31],[50,32,50,36],[49,2,49,11],[49,13,49,18],[49,19,49,22],[49,23,49,27],[49,28,49,31],[49,32,49,36],[52,13,52,18],[52,19,52,22],[52,23,52,27],[52,28,52,31],[52,32,52,36],[51,2,51,11],[51,13,51,18],[51,19,51,22],[51,23,51,27],[51,28,51,31],[51,32,51,36],[54,13,54,18],[54,19,54,22],[54,23,54,27],[54,28,54,31],[54,32,54,36],[53,2,53,11],[53,13,53,18],[53,19,53,22],[53,23,53,27],[53,28,53,31],[53,32,53,36],[56,13,56,18],[56,19,56,22],[56,23,56,27],[56,28,56,31],[56,32,56,36],[55,2,55,11],[55,13,55,18],[55,19,55,22],[55,23,55,27],[55,28,55,31],[55,32,55,36],[59,2,59,11],[59,13,59,18],[59,19,59,22],[59,23,59,27],[59,28,59,31],[59,32,59,36],[57,2,57,11],[57,13,57,18],[57,19,57,22],[57,23,57,27],[57,28,57,31],[57,32,57,36],[58,28,58,31],[58,32,58,36],[61,2,61,11],[61,13,61,18],[61,19,61,22],[61,23,61,27],[61,28,61,31],[61,32,61,36],[60,2,60,11],[60,13,60,18],[60,19,60,22],[60,23,60,27],[60,28,60,31],[60,32,60,36],[63,2,63,11],[63,13,63,18],[63,19,63,22],[63,23,63,27],[63,28,63,31],[63,32,63,36],[62,2,62,11],[62,13,62,18],[62,19,62,22],[62,23,62,27],[62,28,62,31],[62,32,62,36],[65,2,65,11],[65,13,65,18],[65,19,65,22],[65,23,65,27],[65,28,65,31],[65,32,65,36],[64,2,64,11],[64,13,64,18],[64,19,64,22],[64,23,64,27],[64,28,64,31],[64,32,64,36],[67,2,67,11],[67,13,67,18],[67,19,67,22],[67,23,67,27],[67,28,67,31],[67,32,67,36],[66,2,66,11],[66,13,66,18],[66,19,66,22],[66,23,66,27],[66,28,66,31],[66,32,66,36],[69,2,69,11],[69,13,69,18],[69,19,69,22],[69,23,69,27],[69,28,69,31],[69,32,69,36],[68,2,68,11],[68,13,68,18],[68,19,68,22],[68,23,68,27],[68,28,68,31],[68,32,68,36],[70,32,70,36],[71,2,71,11],[71,13,71,18],[71,19,71,22],[71,23,71,27],[71,28,71,31],[71,32,71,36],[70,2,70,11],[70,13,70,18],[70,19,70,22],[70,23,70,27],[70,28,70,31],[74,32,74,36],[72,28,72,31],[72,32,72,36],[73,2,73,11],[73,13,73,18],[73,19,73,22],[73,23,73,27],[73,28,73,31],[73,32,73,36],[72,2,72,11],[72,13,72,18],[72,19,72,22],[72,23,72,27],[74,2,74,11],[74,13,74,18],[74,19,74,22],[74,23,74,27],[74,28,74,31],[76,2,76,11],[76,13,76,18],[76,19,76,22],[76,23,76,27],[76,28,76,31],[76,32,76,36],[75,2,75,11],[75,13,75,18],[75,19,75,22],[75,23,75,27],[75,28,75,31],[75,32,75,36],[78,2,78,11],[78,13,78,18],[78,19,78,22],[78,23,78,27],[78,28,78,31],[78,32,78,36],[77,2,77,11],[77,13,77,18],[77,19,77,22],[77,23,77,27],[77,28,77,31],[77,32,77,36],[86,13,86,18],[86,19,86,22],[80,2,80,11],[80,13,80,18],[80,19,80,22],[80,23,80,27],[80,28,80,31],[80,32,80,36],[79,2,79,11],[79,13,79,18],[79,19,79,22],[79,23,79,27],[79,28,79,31],[79,32,79,36],[81,2,81,11],[81,13,81,18],[81,19,81,22],[81,23,81,27],[81,28,81,31],[83,2,83,11],[83,13,83,18],[83,19,83,22],[83,23,83,27],[83,28,83,31],[86,28,86,31],[84,19,84,22],[84,23,84,27],[84,28,84,31],[84,32,84,36],[90,2,90,11],[90,13,90,18],[90,19,90,22],[90,23,90,27],[90,28,90,31],[89,13,89,18],[89,19,89,22],[89,23,89,27],[89,28,89,31],[88,2,88,11],[88,13,88,18],[88,19,88,22],[88,23,88,27],[88,28,88,31],[87,13,87,18],[87,19,87,22],[87,23,87,27],[87,28,87,31],[86,2,86,11],[91,23,91,27],[91,28,91,31],[91,32,91,36],[90,32,90,36],[89,2,89,11],[87,32,87,36],[81,32,81,36],[82,2,82,11],[82,13,82,18],[82,19,82,22],[82,23,82,27],[82,28,82,31],[82,32,82,36],[86,32,86,36],[85,2,85,11],[85,13,85,18],[85,19,85,22],[85,23,85,27],[85,28,85,31],[85,32,85,36],[83,32,83,36],[84,2,84,11],[84,13,84,18],[86,23,86,27],[88,32,88,36],[87,2,87,11],[94,23,94,27],[94,28,94,31],[94,32,94,36],[93,2,93,11],[93,13,93,18],[93,19,93,22],[93,23,93,27],[93,28,93,31],[93,32,93,36],[94,2,94,11],[94,13,94,18],[94,19,94,22],[89,32,89,36],[92,2,92,11],[92,13,92,18],[92,19,92,22],[92,23,92,27],[92,28,92,31],[92,32,92,36],[91,2,91,11],[91,13,91,18],[91,19,91,22],[96,2,96,11],[96,13,96,18],[96,19,96,22],[96,23,96,27],[96,28,96,31],[96,32,96,36],[95,2,95,11],[95,13,95,18],[95,19,95,22],[95,23,95,27],[95,28,95,31],[95,32,95,36],[98,2,98,11],[98,13,98,18],[98,19,98,22],[98,23,98,27],[98,28,98,31],[98,32,98,36],[97,2,97,11],[97,13,97,18],[97,19,97,22],[97,23,97,27],[97,28,97,31],[97,32,97,36],[100,2,100,11],[100,13,100,18],[100,19,100,22],[100,23,100,27],[100,28,100,31],[100,32,100,36],[99,2,99,11],[99,13,99,18],[99,19,99,22],[99,23,99,27],[99,28,99,31],[99,32,99,36],[102,2,102,11],[102,13,102,18],[102,19,102,22],[102,23,102,27],[102,28,102,31],[102,32,102,36],[101,2,101,11],[101,13,101,18],[101,19,101,22],[101,23,101,27],[101,28,101,31],[101,32,101,36],[104,2,104,11],[104,13,104,18],[104,19,104,22],[104,23,104,27],[104,28,104,31],[104,32,104,36],[103,2,103,11],[103,13,103,18],[103,19,103,22],[103,23,103,27],[103,28,103,31],[103,32,103,36],[106,2,106,11],[106,13,106,18],[106,19,106,22],[106,23,106,27],[106,28,106,31],[106,32,106,36],[105,2,105,11],[105,13,105,18],[105,19,105,22],[105,23,105,27],[105,28,105,31],[105,32,105,36],[108,2,108,11],[108,13,108,18],[108,19,108,22],[108,23,108,27],[108,28,108,31],[108,32,108,36],[107,2,107,11],[107,13,107,18],[107,19,107,22],[107,23,107,27],[107,28,107,31],[107,32,107,36],[110,2,110,11],[110,13,110,18],[110,19,110,22],[110,23,110,27],[110,28,110,31],[110,32,110,36],[109,2,109,11],[109,13,109,18],[109,19,109,22],[109,23,109,27],[109,28,109,31],[109,32,109,36],[112,2,112,11],[112,13,112,18],[112,19,112,22],[112,23,112,27],[112,28,112,31],[112,32,112,36],[111,2,111,11],[111,13,111,18],[111,19,111,22],[111,23,111,27],[111,28,111,31],[111,32,111,36],[114,2,114,11],[114,13,114,18],[114,19,114,22],[114,23,114,27],[114,28,114,31],[114,32,114,36],[113,2,113,11],[113,13,113,18],[113,19,113,22],[113,23,113,27],[113,28,113,31],[113,32,113,36],[116,2,116,11],[116,13,116,18],[116,19,116,22],[116,23,116,27],[116,28,116,31],[116,32,116,36],[115,2,115,11],[115,13,115,18],[115,19,115,22],[115,23,115,27],[115,28,115,31],[115,32,115,36],[118,2,118,11],[118,13,118,18],[118,19,118,22],[118,23,118,27],[118,28,118,31],[118,32,118,36],[117,2,117,11],[117,13,117,18],[117,19,117,22],[117,23,117,27],[117,28,117,31],[117,32,117,36],[120,2,120,11],[120,13,120,18],[120,19,120,22],[120,23,120,27],[120,28,120,31],[120,32,120,36],[119,2,119,11],[119,13,119,18],[119,19,119,22],[119,23,119,27],[119,28,119,31],[119,32,119,36],[122,2,122,11],[122,13,122,18],[122,19,122,22],[122,23,122,27],[122,28,122,31],[122,32,122,36],[121,2,121,11],[121,13,121,18],[121,19,121,22],[121,23,121,27],[121,28,121,31],[121,32,121,36],[124,2,124,11],[124,13,124,18],[124,19,124,22],[124,23,124,27],[124,28,124,31],[124,32,124,36],[123,2,123,11],[123,13,123,18],[123,19,123,22],[123,23,123,27],[123,28,123,31],[123,32,123,36],[126,2,126,11],[126,13,126,18],[126,19,126,22],[126,23,126,27],[126,28,126,31],[126,32,126,36],[125,2,125,11],[125,13,125,18],[125,19,125,22],[125,23,125,27],[125,28,125,31],[125,32,125,36],[127,32,127,36],[128,2,128,11],[128,13,128,18],[128,19,128,22],[128,23,128,27],[128,28,128,31],[128,32,128,36],[127,1,152,1],[127,2,127,11],[127,13,127,18],[127,19,127,22],[127,23,127,27],[127,28,127,31],[129,2,129,11],[129,13,129,18],[129,19,129,22],[129,23,129,27],[131,2,131,11],[131,13,131,18],[131,19,131,22],[131,23,131,27],[131,28,131,31],[131,32,131,36],[129,28,129,31],[129,32,129,36],[130,2,130,11],[130,13,130,18],[130,19,130,22],[130,23,130,27],[130,28,130,31],[130,32,130,36],[133,2,133,11],[133,13,133,18],[133,19,133,22],[133,23,133,27],[133,28,133,31],[133,32,133,36],[132,2,132,11],[132,13,132,18],[132,19,132,22],[132,23,132,27],[132,28,132,31],[132,32,132,36],[135,2,135,11],[135,13,135,18],[135,19,135,22],[135,23,135,27],[135,28,135,31],[135,32,135,36],[134,2,134,11],[134,13,134,18],[134,19,134,22],[134,23,134,27],[134,28,134,31],[134,32,134,36],[137,2,137,11],[137,13,137,18],[137,19,137,22],[137,23,137,27],[137,28,137,31],[137,32,137,36],[136,2,136,11],[136,13,136,18],[136,19,136,22],[136,23,136,27],[136,28,136,31],[136,32,136,36],[139,2,139,11],[139,13,139,18],[139,19,139,22],[139,23,139,27],[139,28,139,31],[139,32,139,36],[138,2,138,11],[138,13,138,18],[138,19,138,22],[138,23,138,27],[138,28,138,31],[138,32,138,36],[141,2,141,11],[141,13,141,18],[141,19,141,22],[141,23,141,27],[141,28,141,31],[141,32,141,36],[140,2,140,11],[140,13,140,18],[140,19,140,22],[140,23,140,27],[140,28,140,31],[140,32,140,36],[143,2,143,11],[143,13,143,18],[143,19,143,22],[143,23,143,27],[143,28,143,31],[143,32,143,36],[142,2,142,11],[142,13,142,18],[142,19,142,22],[142,23,142,27],[142,28,142,31],[142,32,142,36],[152,2,152,11],[152,13,152,18],[152,19,152,22],[152,23,152,27],[152,28,152,31],[152,32,152,36],[151,2,151,11],[151,13,151,18],[151,19,151,22],[151,23,151,27],[151,28,151,31],[151,32,151,36],[159,23,159,27],[159,28,159,31],[159,32,159,36],[158,2,158,11],[158,13,158,18],[158,19,158,22],[158,23,158,27],[158,28,158,31],[158,32,158,36],[159,2,159,11],[159,13,159,18],[159,19,159,22],[161,23,161,27],[161,28,161,31],[161,32,161,36],[160,2,160,11],[160,13,160,18],[160,19,160,22],[160,23,160,27],[160,28,160,31],[160,32,160,36],[161,2,161,11],[161,13,161,18],[161,19,161,22],[163,23,163,27],[163,28,163,31],[163,32,163,36],[162,2,162,11],[162,13,162,18],[162,19,162,22],[162,23,162,27],[162,28,162,31],[162,32,162,36],[163,2,163,11],[163,13,163,18],[163,19,163,22],[165,23,165,27],[165,28,165,31],[165,32,165,36],[164,2,164,11],[164,13,164,18],[164,19,164,22],[164,23,164,27],[164,28,164,31],[164,32,164,36],[165,2,165,11],[165,13,165,18],[165,19,165,22],[167,23,167,27],[167,28,167,31],[167,32,167,36],[166,2,166,11],[166,13,166,18],[166,19,166,22],[166,23,166,27],[166,28,166,31],[166,32,166,36],[167,2,167,11],[167,13,167,18],[167,19,167,22],[169,23,169,27],[169,28,169,31],[169,32,169,36],[168,2,168,11],[168,13,168,18],[168,19,168,22],[168,23,168,27],[168,28,168,31],[168,32,168,36],[169,2,169,11],[169,13,169,18],[169,19,169,22],[144,23,144,27],[144,28,144,31],[144,32,144,36],[145,2,145,11],[145,13,145,18],[145,19,145,22],[145,23,145,27],[145,28,145,31],[145,32,145,36],[144,2,144,11],[144,13,144,18],[144,19,144,22],[147,23,147,27],[147,28,147,31],[147,32,147,36],[146,2,146,11],[146,13,146,18],[146,19,146,22],[146,23,146,27],[146,28,146,31],[146,32,146,36],[7,9,7,10],[7,2,7,7],[4,2,4,36],[150,2,150,11],[150,13,150,18],[150,19,150,22],[150,23,150,27],[150,28,150,31],[150,32,150,36],[149,2,149,11],[149,13,149,18],[149,19,149,22],[149,23,149,27],[149,28,149,31],[149,32,149,36],[148,2,148,11],[148,13,148,18],[148,19,148,22],[148,23,148,27],[148,28,148,31],[148,32,148,36],[147,2,147,11],[147,13,147,18],[147,19,147,22]]}
[null,null,null,null,null,null,null,null,null,null,null,null,null,null,null,null,null,null,null,null,null,null,null,null,null,null,null,null,null,null,null,null,null,null,null,null,null,null,null,"<"]
[null,null,"TOXICS SCREENING ANALYSIS"]
[null,null,"WATER QUALITY POLLUTANTS OF CONCERN"]
[null,null,"VERSION 2.7"]
[null,null," "]
[null,null,"Facility:",null,null,null,null,null,null,null,null,null,null,null,null,null,null,null,null,"NPDES Permit No.:",null,null,null,null,null,null,null,null,null,null,null,null,null,"Outfall:"]
[null,null,"Analysis Hardness (mg/L):",null,null,null,null,null,null,100,null,null,null,null,null,null,null,null,null,"Discharge Flow (MGD):",null,null,null,null,null,null,null,null,null,null,"Analysis pH (SU):",null,null,null,null,7,null,null,null,"Stream Flow (MGD)",null,{"$f":"IF(J8<>\"\",IF(J8<>0,J8*0.64631,0.000001),\"\")","v":""}]
[null,null,"Stream Flow, Q7-10 (cfs):",null,null,null,null,null,null,null,null,null,null,null,null,null,null,null,null,null,null,null,null,null,null,null,null,null,null,null,null,null,null,null,null,null,null,null,null,"Stream:Discharge",null,{"$f":"IF(AND(AP7<>\"\",Z7<>\"\"),AP7/Z7,\"\")","v":""}]
[null,null,null,null,null,null,null,null,null,null,null,null,null,null,null,null,null,null,null,null,null,null,null,null,null,null,null,null,null,null,null,null,null,null,null,null,null,null,null,"Assimilative Capacity?",null,{"$f":"IF(AP7=0,\"No\",IF(AP8<3,\"No\",\"Yes\"))","v":"Yes"}]
[null,null,"Parameter",null,null,null,null,null,null,null,null,null,"Maximum Concentration in Application or DMRs (µg/L)",null,null,null,null,null,null,"Most Stringent Criterion (µg/L)",null,null,null,"Candidate for PENTOXSD Modeling?",null,null,null,null,"Most Stringent WQBEL (µg/L)",null,null,null,"Screening Recommendation"]
[null,null,null,null,null,null,null,null,null,null,null,null,null,null,null,null,null,null,null,null,null,null,null,null,null,null,null,null,null,null,null,null,null,null,null,null,null,null,null,"QL","Conservative?","BCS1M Screen 1","Screening Low","Screening High","BCS1M Screen 2","Final Rec."]
[null,"Group 1","Total Dissolved Solids",null,null,null,null,null,null,null,null,null,null,null,null,null,null,null,null,{"$f":"IF(C12<>\"\",IF(VLOOKUP(C12,Reference!$A$3:$B$188,2,FALSE)=\"\",\"N/A\",VLOOKUP(C12,Reference!$A$3:$B$188,2,FALSE)),\"\")","v":500000},null,null,null,{"$f":"IF(AND(C12<>\"\",N12<>\"\",$J$8<>\"\",$Z$7<>\"\"),IF(T12<>\"N/A\",IF(AND(N12<=VALUE(AN12),M12=\"<\"),\"No (Value < QL)\",IF($AP$9=\"No\",IF(N12>=(0.5*T12),IF(AND(M12=\"<\",N12=(0.5*T12)),\"No\",\"Yes\"),\"No\"),IF(N12>=T12,IF(AND(M12=\"<\",N12=T12),\"No\",\"Yes\"),\"No\"))),\"No\"),\"\")","v":""},null,null,null,null,null,null,null,null,{"$f":"IF($N12<>\"\",AT12,\"\")","v":""},null,null,null,null,null,null,{"$f":"IF(C12<>\"\",IF(VLOOKUP(C12,Reference!$I$3:$J$188,2,FALSE)=\" \",0,VLOOKUP(C12,Reference!$I$3:$J$188,2,FALSE)),\"\")","v":2000},{"$f":"IF(C12<>\"\",IF(VLOOKUP(C12,Reference!$M$3:$Q$188,5,FALSE)=\" \",0,VLOOKUP(C12,Reference!$M$3:$Q$188,5,FALSE)),\"\")","v":"Y"},{"$f":"IF(AND(X12=\"Yes\",AC12<>\"\"),IF((N12/AC12)>=0.5,\"Establish Limits\",IF(AND(AO12=\"Y\",(N12/AC12)>0.1),\"Monitor\",IF(AND(AO12<>\"Y\",(N12/AC12)>0.25),\"Monitor\",\"No Limits/Monitoring\"))),\"\")","v":""},1000000,5000000,{"$f":"IF(AND(N12<>\"\",$Z$7<>\"\"),IF(OR(AND($Z$7>0.1,N12>AQ12),AND($Z$7<=0.1,N12>AR12),(($Z$7*(N12/1000)*8.34)>20000)),\"Monitor\",\"\"),\"\")","v":""},{"$f":"IF(OR(AP12=\"Establish Limits\",AP12=\"Monitor\"),AP12,IF(AND(AP12=\"No Limits/Monitoring\",AS12=\"Monitor\"),AS12,IF(AND(AP12=\"\",AS12=\"\"),\"\",IF(AND(AP12=\"\",AS12=\"Monitor\"),\"Monitor\",IF(AND(AP12=\"No Limits/Monitoring\",AS12=\"\"),\"No Limits/Monitoring\",\"\")))))","v":""}]
[null,null,"Chloride",null,null,null,null,null,null,null,null,null,null,null,null,null,null,null,null,{"$f":"IF(C13<>\"\",IF(VLOOKUP(C13,Reference!$A$3:$B$188,2,FALSE)=\"\",\"N/A\",VLOOKUP(C13,Reference!$A$3:$B$188,2,FALSE)),\"\")","v":250000},null,null,null,{"$f":"IF(AND(C13<>\"\",N13<>\"\",$J$8<>\"\",$Z$7<>\"\"),IF(T13<>\"N/A\",IF(AND(N13<=VALUE(AN13),M13=\"<\"),\"No (Value < QL)\",IF($AP$9=\"No\",IF(N13>=(0.5*T13),IF(AND(M13=\"<\",N13=(0.5*T13)),\"No\",\"Yes\"),\"No\"),IF(N13>=T13,IF(AND(M13=\"<\",N13=T13),\"No\",\"Yes\"),\"No\"))),\"No\"),\"\")","v":""},null,null,null,null,null,null,null,null,{"$f":"AT13","v":""},null,null,null,null,null,null,{"$f":"IF(C13<>\"\",IF(VLOOKUP(C13,Reference!$I$3:$J$188,2,FALSE)=\" \",0,VLOOKUP(C13,Reference!$I$3:$J$188,2,FALSE)),\"\")","v":500},{"$f":"IF(C13<>\"\",IF(VLOOKUP(C13,Reference!$M$3:$Q$188,5,FALSE)=\" \",0,VLOOKUP(C13,Reference!$M$3:$Q$188,5,FALSE)),\"\")","v":"Y"},{"$f":"IF(AND(X13=\"Yes\",AC13<>\"\"),IF((N13/AC13)>=0.5,\"Establish Limits\",IF(AND(AO13=\"Y\",(N13/AC13)>0.1),\"Monitor\",IF(AND(AO13<>\"Y\",(N13/AC13)>0.25),\"Monitor\",\"No Limits/Monitoring\"))),\"\")","v":""},null,null,null,{"$f":"IF(OR(AP13=\"Establish Limits\",AP13=\"Monitor\"),AP13,IF(AND(AP13=\"\",OR($AT$12=\"No Limits/Monitoring\",$AT$12=\"\")),\"\",IF(AND(OR(AP13=\"\",AP13=\"No Limits/Monitoring\"),OR($AT$12=\"Monitor\",$AT$12=\"Establish Limits\")),\"Monitor\",IF(AND(AP13=\"No Limits/Monitoring\",$AT$12=\"\"),AP13))))","v":""}]
[null,null,"Bromide",null,null,null,null,null,null,null,null,null,null,null,null,null,null,null,null,{"$f":"IF(C14<>\"\",IF(VLOOKUP(C14,Reference!$A$3:$B$188,2,FALSE)=\"\",\"N/A\",VLOOKUP(C14,Reference!$A$3:$B$188,2,FALSE)),\"\")","v":"N/A"},null,null,null,"",null,null,null,null,null,null,null,null,{"$f":"AT14","v":""},null,null,null,null,null,null,{"$f":"IF(C14<>\"\",IF(VLOOKUP(C14,Reference!$I$3:$J$188,2,FALSE)=\" \",0,VLOOKUP(C14,Reference!$I$3:$J$188,2,FALSE)),\"\")","v":200},{"$f":"IF(C14<>\"\",IF(VLOOKUP(C14,Reference!$M$3:$Q$188,5,FALSE)=\" \",0,VLOOKUP(C14,Reference!$M$3:$Q$188,5,FALSE)),\"\")","v":"Y"},"",1000,10000,{"$f":"IF(AND(N14<>\"\",$Z$7<>\"\"),IF(OR(AND($Z$7>0.1,N14>AQ14),AND($Z$7<=0.1,N14>AR14)),\"Monitor\",\"\"),\"\")","v":""},{"$f":"IF(OR(AP14=\"Establish Limits\",AP14=\"Monitor\"),AP14,IF(AND(AP14=\"No Limits/Monitoring\",AS14=\"Monitor\"),AS14,IF(AND(AP14=\"\",AS14=\"\",$AT$12=\"\"),\"\",IF(AND(AP14=\"\",AS14=\"Monitor\"),\"Monitor\",IF(AND(AP14=\"\",AS14=\"\",OR($AT$12=\"Monitor\",$AT$12=\"Establish Limits\")),\"Monitor\",\"\")))))","v":""}]
[null,null,"Sulfate",null,null,null,null,null,null,null,null,null,null,null,null,null,null,null,null,{"$f":"IF(C15<>\"\",IF(VLOOKUP(C15,Reference!$A$3:$B$188,2,FALSE)=\"\",\"N/A\",VLOOKUP(C15,Reference!$A$3:$B$188,2,FALSE)),\"\")","v":250000},null,null,null,"",null,null,null,null,null,null,null,null,{"$f":"AT15","v":""},null,null,null,null,null,null,{"$f":"IF(C15<>\"\",IF(VLOOKUP(C15,Reference!$I$3:$J$188,2,FALSE)=\" \",0,VLOOKUP(C15,Reference!$I$3:$J$188,2,FALSE)),\"\")","v":1000},{"$f":"IF(C15<>\"\",IF(VLOOKUP(C15,Reference!$M$3:$Q$188,5,FALSE)=\" \",0,VLOOKUP(C15,Reference!$M$3:$Q$188,5,FALSE)),\"\")","v":"Y"},"",null,null,null,{"$f":"IF(OR(AP15=\"Establish Limits\",AP15=\"Monitor\"),AP15,IF(AND(AP15=\"\",OR($AT$12=\"No Limits/Monitoring\",$AT$12=\"\")),\"\",IF(AND(OR(AP15=\"\",AP15=\"No Limits/Monitoring\"),OR($AT$12=\"Monitor\",$AT$12=\"Establish Limits\")),\"Monitor\",IF(AND(AP15=\"No Limits/Monitoring\",$AT$12=\"\"),AP15))))","v":""}]
[null,null,"Fluoride",null,null,null,null,null,null,null,null,null,null,null,null,null,null,null,null,{"$f":"IF(C16<>\"\",IF(VLOOKUP(C16,Reference!$A$3:$B$188,2,FALSE)=\"\",\"N/A\",VLOOKUP(C16,Reference!$A$3:$B$188,2,FALSE)),\"\")","v":2000},null,null,null,"",null,null,null,null,null,null,null,null,{"$f":"IF($N16<>\"\",IF(AND(X16=\"Yes\",AC16<>\"\"),IF(($N16/$AC16)>=0.5,\"Establish Limits\",IF(AND($AO16=\"Y\",($N16/$AC16)>=0.1),\"Monitor\",IF(AND($AO16<>\"Y\",($N16/$AC16)>=0.25),\"Monitor\",\"No Limits/Monitoring\"))),\"\"),\"\")","v":""},null,null,null,null,null,null,{"$f":"IF(C16<>\"\",IF(VLOOKUP(C16,Reference!$I$3:$J$188,2,FALSE)=\" \",0,VLOOKUP(C16,Reference!$I$3:$J$188,2,FALSE)),\"\")","v":200},{"$f":"IF(C16<>\"\",IF(VLOOKUP(C16,Reference!$M$3:$Q$188,5,FALSE)=\" \",0,VLOOKUP(C16,Reference!$M$3:$Q$188,5,FALSE)),\"\")","v":"Y"},""]
[null,"Group 2","Total Aluminum",null,null,null,null,null,null,null,null,null,null,null,null,null,null,null,null,{"$f":"IF(C17<>\"\",IF(VLOOKUP(C17,Reference!$A$3:$B$188,2,FALSE)=\"\",\"N/A\",VLOOKUP(C17,Reference!$A$3:$B$188,2,FALSE)),\"\")","v":750},null,null,null,"",null,null,null,null,null,null,null,null,{"$f":"IF($N17<>\"\",IF(AND(X17=\"Yes\",AC17<>\"\"),IF(($N17/$AC17)>=0.5,\"Establish Limits\",IF(AND($AO17=\"Y\",($N17/$AC17)>0.1),\"Monitor\",IF(AND($AO17<>\"Y\",($N17/$AC17)>0.25),\"Monitor\",\"No Limits/Monitoring\"))),\"\"),\"\")","v":""},null,null,null,null,null,null,{"$f":"IF(C17<>\"\",IF(VLOOKUP(C17,Reference!$I$3:$J$188,2,FALSE)=\" \",0,VLOOKUP(C17,Reference!$I$3:$J$188,2,FALSE)),\"\")","v":10},{"$f":"IF(C17<>\"\",IF(VLOOKUP(C17,Reference!$M$3:$Q$188,5,FALSE)=\" \",0,VLOOKUP(C17,Reference!$M$3:$Q$188,5,FALSE)),\"\")","v":"Y"}]
[null,null,"Total Antimony",null,null,null,null,null,null,null,null,null,null,null,null,null,null,null,null,{"$f":"IF(C18<>\"\",IF(VLOOKUP(C18,Reference!$A$3:$B$188,2,FALSE)=\"\",\"N/A\",VLOOKUP(C18,Reference!$A$3:$B$188,2,FALSE)),\"\")","v":5.6},null,null,null,"",null,null,null,null,null,null,null,null,{"$f":"IF($N18<>\"\",IF(AND(X18=\"Yes\",AC18<>\"\"),IF(($N18/$AC18)>=0.5,\"Establish Limits\",IF(AND($AO18=\"Y\",($N18/$AC18)>0.1),\"Monitor\",IF(AND($AO18<>\"Y\",($N18/$AC18)>0.25),\"Monitor\",\"No Limits/Monitoring\"))),\"\"),\"\")","v":""},null,null,null,null,null,null,{"$f":"IF(C18<>\"\",IF(VLOOKUP(C18,Reference!$I$3:$J$188,2,FALSE)=\" \",0,VLOOKUP(C18,Reference!$I$3:$J$188,2,FALSE)),\"\")","v":2},{"$f":"IF(C18<>\"\",IF(VLOOKUP(C18,Reference!$M$3:$Q$188,5,FALSE)=\" \",0,VLOOKUP(C18,Reference!$M$3:$Q$188,5,FALSE)),\"\")","v":"Y"}]
[null,null,"Total Arsenic",null,null,null,null,null,null,null,null,null,null,null,null,null,null,null,null,{"$f":"IF(C19<>\"\",IF(VLOOKUP(C19,Reference!$A$3:$B$188,2,FALSE)=\"\",\"N/A\",VLOOKUP(C19,Reference!$A$3:$B$188,2,FALSE)),\"\")","v":10},null,null,null,"",null,null,null,null,null,null,null,null,"",null,null,null,null,null,null,{"$f":"IF(C19<>\"\",IF(VLOOKUP(C19,Reference!$I$3:$J$188,2,FALSE)=\" \",0,VLOOKUP(C19,Reference!$I$3:$J$188,2,FALSE)),\"\")","v":3},{"$f":"IF(C19<>\"\",IF(VLOOKUP(C19,Reference!$M$3:$Q$188,5,FALSE)=\" \",0,VLOOKUP(C19,Reference!$M$3:$Q$188,5,FALSE)),\"\")","v":"Y"}]
[null,null,"Total Barium",null,null,null,null,null,null,null,null,null,null,null,null,null,null,null,null,{"$f":"IF(C20<>\"\",IF(VLOOKUP(C20,Reference!$A$3:$B$188,2,FALSE)=\"\",\"N/A\",VLOOKUP(C20,Reference!$A$3:$B$188,2,FALSE)),\"\")","v":2400},null,null,null,"",null,null,null,null,null,null,null,null,"",null,null,null,null,null,null,{"$f":"IF(C20<>\"\",IF(VLOOKUP(C20,Reference!$I$3:$J$188,2,FALSE)=\" \",0,VLOOKUP(C20,Reference!$I$3:$J$188,2,FALSE)),\"\")","v":2},{"$f":"IF(C20<>\"\",IF(VLOOKUP(C20,Reference!$M$3:$Q$188,5,FALSE)=\" \",0,VLOOKUP(C20,Reference!$M$3:$Q$188,5,FALSE)),\"\")","v":"Y"}]
[null,null,"Total Beryllium",null,null,null,null,null,null,null,null,null,null,null,null,null,null,null,null,{"$f":"IF(C21<>\"\",IF(VLOOKUP(C21,Reference!$A$3:$B$188,2,FALSE)=\"\",\"N/A\",VLOOKUP(C21,Reference!$A$3:$B$188,2,FALSE)),\"\")","v":"N/A"},null,null,null,{"$f":"IF(AND(C21<>\"\",N21<>\"\",$J$8<>\"\",$Z$7<>\"\"),IF(T21<>\"N/A\",IF(AND(N21<=VALUE(AN21),M21=\"<\"),\"No (Value < QL)\",IF($AP$9=\"No\",IF(N21>=(0.5*T21),IF(AND(M21=\"<\",N21=(0.5*T21)),\"No\",\"Yes\"),\"No\"),IF(N21>=T21,IF(AND(M21=\"<\",N21=T21),\"No\",\"Yes\"),\"No\"))),\"No\"),\"\")","v":""},null,null,null,null,null,null,null,null,"",null,null,null,null,null,null,{"$f":"IF(C21<>\"\",IF(VLOOKUP(C21,Reference!$I$3:$J$188,2,FALSE)=\" \",0,VLOOKUP(C21,Reference!$I$3:$J$188,2,FALSE)),\"\")","v":1},{"$f":"IF(C21<>\"\",IF(VLOOKUP(C21,Reference!$M$3:$Q$188,5,FALSE)=\" \",0,VLOOKUP(C21,Reference!$M$3:$Q$188,5,FALSE)),\"\")","v":"Y"}]
[null,null,"Total Boron",null,null,null,null,null,null,null,null,null,null,null,null,null,null,null,null,{"$f":"IF(C22<>\"\",IF(VLOOKUP(C22,Reference!$A$3:$B$188,2,FALSE)=\"\",\"N/A\",VLOOKUP(C22,Reference!$A$3:$B$188,2,FALSE)),\"\")","v":1600},null,null,null,"",null,null,null,null,null,null,null,null,"",null,null,null,null,null,null,{"$f":"IF(C22<>\"\",IF(VLOOKUP(C22,Reference!$I$3:$J$188,2,FALSE)=\" \",0,VLOOKUP(C22,Reference!$I$3:$J$188,2,FALSE)),\"\")","v":200},{"$f":"IF(C22<>\"\",IF(VLOOKUP(C22,Reference!$M$3:$Q$188,5,FALSE)=\" \",0,VLOOKUP(C22,Reference!$M$3:$Q$188,5,FALSE)),\"\")","v":"Y"}]
[null,null,"Total Cadmium",null,null,null,null,null,null,null,null,null,null,null,null,null,null,null,null,{"$f":"IF(C23<>\"\",IF(VLOOKUP(C23,Reference!$A$3:$B$188,2,FALSE)=\"\",\"N/A\",VLOOKUP(C23,Reference!$A$3:$B$188,2,FALSE)),\"\")","v":0.27100000000000002},null,null,null,"",null,null,null,null,null,null,null,null,"",null,null,null,null,null,null,{"$f":"IF(C23<>\"\",IF(VLOOKUP(C23,Reference!$I$3:$J$188,2,FALSE)=\" \",0,VLOOKUP(C23,Reference!$I$3:$J$188,2,FALSE)),\"\")","v":0.2},{"$f":"IF(C23<>\"\",IF(VLOOKUP(C23,Reference!$M$3:$Q$188,5,FALSE)=\" \",0,VLOOKUP(C23,Reference!$M$3:$Q$188,5,FALSE)),\"\")","v":"Y"}]
[null,null,"Total Chromium",null,null,null,null,null,null,null,null,null,null,null,null,null,null,null,null,{"$f":"IF(C24<>\"\",IF(VLOOKUP(C24,Reference!$A$3:$B$188,2,FALSE)=\"\",\"N/A\",VLOOKUP(C24,Reference!$A$3:$B$188,2,FALSE)),\"\")","v":"N/A"},null,null,null,"",null,null,null,null,null,null,null,null,"",null,null,null,null,null,null,{"$f":"IF(C24<>\"\",IF(VLOOKUP(C24,Reference!$I$3:$J$188,2,FALSE)=\" \",0,VLOOKUP(C24,Reference!$I$3:$J$188,2,FALSE)),\"\")","v":4},{"$f":"IF(C24<>\"\",IF(VLOOKUP(C24,Reference!$M$3:$Q$188,5,FALSE)=\" \",0,VLOOKUP(C24,Reference!$M$3:$Q$188,5,FALSE)),\"\")","v":"Y"}]
[null,null,"Hexavalent Chromium",null,null,null,null,null,null,null,null,null,null,null,null,null,null,null,null,{"$f":"IF(C25<>\"\",IF(VLOOKUP(C25,Reference!$A$3:$B$188,2,FALSE)=\"\",\"N/A\",VLOOKUP(C25,Reference!$A$3:$B$188,2,FALSE)),\"\")","v":10.395010395010395},null,null,null,"",null,null,null,null,null,null,null,null,"",null,null,null,null,null,null,{"$f":"IF(C25<>\"\",IF(VLOOKUP(C25,Reference!$I$3:$J$188,2,FALSE)=\" \",0,VLOOKUP(C25,Reference!$I$3:$J$188,2,FALSE)),\"\")","v":1},{"$f":"IF(C25<>\"\",IF(VLOOKUP(C25,Reference!$M$3:$Q$188,5,FALSE)=\" \",0,VLOOKUP(C25,Reference!$M$3:$Q$188,5,FALSE)),\"\")","v":"Y"}]
[null,null,"Total Cobalt",null,null,null,null,null,null,null,null,null,null,null,null,null,null,null,null,{"$f":"IF(C26<>\"\",IF(VLOOKUP(C26,Reference!$A$3:$B$188,2,FALSE)=\"\",\"N/A\",VLOOKUP(C26,Reference!$A$3:$B$188,2,FALSE)),\"\")","v":19},null,null,null,"",null,null,null,null,null,null,null,null,"",null,null,null,null,null,null,{"$f":"IF(C26<>\"\",IF(VLOOKUP(C26,Reference!$I$3:$J$188,2,FALSE)=\" \",0,VLOOKUP(C26,Reference!$I$3:$J$188,2,FALSE)),\"\")","v":1},{"$f":"IF(C26<>\"\",IF(VLOOKUP(C26,Reference!$M$3:$Q$188,5,FALSE)=\" \",0,VLOOKUP(C26,Reference!$M$3:$Q$188,5,FALSE)),\"\")","v":"Y"}]
[null,null,"Total Copper",null,null,null,null,null,null,null,null,null,null,null,null,null,null,null,null,{"$f":"IF(C27<>\"\",IF(VLOOKUP(C27,Reference!$A$3:$B$188,2,FALSE)=\"\",\"N/A\",VLOOKUP(C27,Reference!$A$3:$B$188,2,FALSE)),\"\")","v":9.33},null,null,null,"",null,null,null,null,null,null,null,null,"",null,null,null,null,null,null,{"$f":"IF(C27<>\"\",IF(VLOOKUP(C27,Reference!$I$3:$J$188,2,FALSE)=\" \",0,VLOOKUP(C27,Reference!$I$3:$J$188,2,FALSE)),\"\")","v":4},{"$f":"IF(C27<>\"\",IF(VLOOKUP(C27,Reference!$M$3:$Q$188,5,FALSE)=\" \",0,VLOOKUP(C27,Reference!$M$3:$Q$188,5,FALSE)),\"\")","v":"Y"}]
[null,null,"Total Cyanide",null,null,null,null,null,null,null,null,null,null,null,null,null,null,null,null,{"$f":"IF(C28<>\"\",IF(VLOOKUP(C28,Reference!$A$3:$B$188,2,FALSE)=\"\",\"N/A\",VLOOKUP(C28,Reference!$A$3:$B$188,2,FALSE)),\"\")","v":"N/A"},null,null,null,"",null,null,null,null,null,null,null,null,"",null,null,null,null,null,null,{"$f":"IF(C28<>\"\",IF(VLOOKUP(C28,Reference!$I$3:$J$188,2,FALSE)=\" \",0,VLOOKUP(C28,Reference!$I$3:$J$188,2,FALSE)),\"\")","v":10},{"$f":"IF(C28<>\"\",IF(VLOOKUP(C28,Reference!$M$3:$Q$188,5,FALSE)=\" \",0,VLOOKUP(C28,Reference!$M$3:$Q$188,5,FALSE)),\"\")","v":0}]
[null,null,"Total Iron",null,null,null,null,null,null,null,null,null,null,null,null,null,null,null,null,{"$f":"IF(C29<>\"\",IF(VLOOKUP(C29,Reference!$A$3:$B$188,2,FALSE)=\"\",\"N/A\",VLOOKUP(C29,Reference!$A$3:$B$188,2,FALSE)),\"\")","v":1500},null,null,null,"",null,null,null,null,null,null,null,null,"",null,null,null,null,null,null,{"$f":"IF(C29<>\"\",IF(VLOOKUP(C29,Reference!$I$3:$J$188,2,FALSE)=\" \",0,VLOOKUP(C29,Reference!$I$3:$J$188,2,FALSE)),\"\")","v":20},{"$f":"IF(C29<>\"\",IF(VLOOKUP(C29,Reference!$M$3:$Q$188,5,FALSE)=\" \",0,VLOOKUP(C29,Reference!$M$3:$Q$188,5,FALSE)),\"\")","v":"Y"}]
[null,null,"Dissolved Iron",null,null,null,null,null,null,null,null,null,null,null,null,null,null,null,null,{"$f":"IF(C30<>\"\",IF(VLOOKUP(C30,Reference!$A$3:$B$188,2,FALSE)=\"\",\"N/A\",VLOOKUP(C30,Reference!$A$3:$B$188,2,FALSE)),\"\")","v":300},null,null,null,"",null,null,null,null,null,null,null,null,"",null,null,null,null,null,null,{"$f":"IF(C30<>\"\",IF(VLOOKUP(C30,Reference!$I$3:$J$188,2,FALSE)=\" \",0,VLOOKUP(C30,Reference!$I$3:$J$188,2,FALSE)),\"\")","v":20},{"$f":"IF(C30<>\"\",IF(VLOOKUP(C30,Reference!$M$3:$Q$188,5,FALSE)=\" \",0,VLOOKUP(C30,Reference!$M$3:$Q$188,5,FALSE)),\"\")","v":"Y"}]
[null,null,"Total Lead",null,null,null,null,null,null,null,null,null,null,null,null,null,null,null,null,{"$f":"IF(C31<>\"\",IF(VLOOKUP(C31,Reference!$A$3:$B$188,2,FALSE)=\"\",\"N/A\",VLOOKUP(C31,Reference!$A$3:$B$188,2,FALSE)),\"\")","v":3.18},null,null,null,"",null,null,null,null,null,null,null,null,"",null,null,null,null,null,null,{"$f":"IF(C31<>\"\",IF(VLOOKUP(C31,Reference!$I$3:$J$188,2,FALSE)=\" \",0,VLOOKUP(C31,Reference!$I$3:$J$188,2,FALSE)),\"\")","v":1},{"$f":"IF(C31<>\"\",IF(VLOOKUP(C31,Reference!$M$3:$Q$188,5,FALSE)=\" \",0,VLOOKUP(C31,Reference!$M$3:$Q$188,5,FALSE)),\"\")","v":"Y"}]
[null,null,"Total Manganese",null,null,null,null,null,null,null,null,null,null,null,null,null,null,null,null,{"$f":"IF(C32<>\"\",IF(VLOOKUP(C32,Reference!$A$3:$B$188,2,FALSE)=\"\",\"N/A\",VLOOKUP(C32,Reference!$A$3:$B$188,2,FALSE)),\"\")","v":1000},null,null,null,"",null,null,null,null,null,null,null,null,"",null,null,null,null,null,null,{"$f":"IF(C32<>\"\",IF(VLOOKUP(C32,Reference!$I$3:$J$188,2,FALSE)=\" \",0,VLOOKUP(C32,Reference!$I$3:$J$188,2,FALSE)),\"\")","v":2},{"$f":"IF(C32<>\"\",IF(VLOOKUP(C32,Reference!$M$3:$Q$188,5,FALSE)=\" \",0,VLOOKUP(C32,Reference!$M$3:$Q$188,5,FALSE)),\"\")","v":"Y"}]
[null,null,"Total Mercury",null,null,null,null,null,null,null,null,null,null,null,null,null,null,null,null,{"$f":"IF(C33<>\"\",IF(VLOOKUP(C33,Reference!$A$3:$B$188,2,FALSE)=\"\",\"N/A\",VLOOKUP(C33,Reference!$A$3:$B$188,2,FALSE)),\"\")","v":0.05},null,null,null,"",null,null,null,null,null,null,null,null,"",null,null,null,null,null,null,{"$f":"IF(C33<>\"\",IF(VLOOKUP(C33,Reference!$I$3:$J$188,2,FALSE)=\" \",0,VLOOKUP(C33,Reference!$I$3:$J$188,2,FALSE)),\"\")","v":0.2},{"$f":"IF(C33<>\"\",IF(VLOOKUP(C33,Reference!$M$3:$Q$188,5,FALSE)=\" \",0,VLOOKUP(C33,Reference!$M$3:$Q$188,5,FALSE)),\"\")","v":"Y"}]
[null,null,"Total Molybdenum",null,null,null,null,null,null,null,null,null,null,null,null,null,null,null,null,{"$f":"IF(C34<>\"\",IF(VLOOKUP(C34,Reference!$A$3:$B$188,2,FALSE)=\"\",\"N/A\",VLOOKUP(C34,Reference!$A$3:$B$188,2,FALSE)),\"\")","v":"N/A"},null,null,null,"",null,null,null,null,null,null,null,null,"",null,null,null,null,null,null,{"$f":"IF(C34<>\"\",IF(VLOOKUP(C34,Reference!$I$3:$J$188,2,FALSE)=\" \",0,VLOOKUP(C34,Reference!$I$3:$J$188,2,FALSE)),\"\")","v":4},{"$f":"IF(C34<>\"\",IF(VLOOKUP(C34,Reference!$M$3:$Q$188,5,FALSE)=\" \",0,VLOOKUP(C34,Reference!$M$3:$Q$188,5,FALSE)),\"\")","v":"Y"}]
[null,null,"Total Nickel",null,null,null,null,null,null,null,null,null,null,null,null,null,null,null,null,{"$f":"IF(C35<>\"\",IF(VLOOKUP(C35,Reference!$A$3:$B$188,2,FALSE)=\"\",\"N/A\",VLOOKUP(C35,Reference!$A$3:$B$188,2,FALSE)),\"\")","v":52.2},null,null,null,"",null,null,null,null,null,null,null,null,"",null,null,null,null,null,null,{"$f":"IF(C35<>\"\",IF(VLOOKUP(C35,Reference!$I$3:$J$188,2,FALSE)=\" \",0,VLOOKUP(C35,Reference!$I$3:$J$188,2,FALSE)),\"\")","v":4},{"$f":"IF(C35<>\"\",IF(VLOOKUP(C35,Reference!$M$3:$Q$188,5,FALSE)=\" \",0,VLOOKUP(C35,Reference!$M$3:$Q$188,5,FALSE)),\"\")","v":"Y"}]
[null,null,"Total Phenols (Phenolics)",null,null,null,null,null,null,null,null,null,null,null,null,null,null,null,null,{"$f":"IF(C36<>\"\",IF(VLOOKUP(C36,Reference!$A$3:$B$188,2,FALSE)=\"\",\"N/A\",VLOOKUP(C36,Reference!$A$3:$B$188,2,FALSE)),\"\")","v":5},null,null,null,"",null,null,null,null,null,null,null,null,"",null,null,null,null,null,null,{"$f":"IF(C36<>\"\",IF(VLOOKUP(C36,Reference!$I$3:$J$188,2,FALSE)=\" \",0,VLOOKUP(C36,Reference!$I$3:$J$188,2,FALSE)),\"\")","v":5},{"$f":"IF(C36<>\"\",IF(VLOOKUP(C36,Reference!$M$3:$Q$188,5,FALSE)=\" \",0,VLOOKUP(C36,Reference!$M$3:$Q$188,5,FALSE)),\"\")","v":0}]
[null,null,"Total Selenium",null,null,null,null,null,null,null,null,null,null,null,null,null,null,null,null,{"$f":"IF(C37<>\"\",IF(VLOOKUP(C37,Reference!$A$3:$B$188,2,FALSE)=\"\",\"N/A\",VLOOKUP(C37,Reference!$A$3:$B$188,2,FALSE)),\"\")","v":4.9891540130151837},null,null,null,"",null,null,null,null,null,null,null,null,"",null,null,null,null,null,null,{"$f":"IF(C37<>\"\",IF(VLOOKUP(C37,Reference!$I$3:$J$188,2,FALSE)=\" \",0,VLOOKUP(C37,Reference!$I$3:$J$188,2,FALSE)),\"\")","v":5},{"$f":"IF(C37<>\"\",IF(VLOOKUP(C37,Reference!$M$3:$Q$188,5,FALSE)=\" \",0,VLOOKUP(C37,Reference!$M$3:$Q$188,5,FALSE)),\"\")","v":"Y"}]
[null,null,"Total Silver",null,null,null,null,null,null,null,null,null,null,null,null,null,null,null,null,{"$f":"IF(C38<>\"\",IF(VLOOKUP(C38,Reference!$A$3:$B$188,2,FALSE)=\"\",\"N/A\",VLOOKUP(C38,Reference!$A$3:$B$188,2,FALSE)),\"\")","v":3.78},null,null,null,"",null,null,null,null,null,null,null,null,"",null,null,null,null,null,null,{"$f":"IF(C38<>\"\",IF(VLOOKUP(C38,Reference!$I$3:$J$188,2,FALSE)=\" \",0,VLOOKUP(C38,Reference!$I$3:$J$188,2,FALSE)),\"\")","v":0.4},{"$f":"IF(C38<>\"\",IF(VLOOKUP(C38,Reference!$M$3:$Q$188,5,FALSE)=\" \",0,VLOOKUP(C38,Reference!$M$3:$Q$188,5,FALSE)),\"\")","v":"Y"}]
[null,null,"Total Thallium",null,null,null,null,null,null,null,null,null,null,null,null,null,null,null,null,{"$f":"IF(C39<>\"\",IF(VLOOKUP(C39,Reference!$A$3:$B$188,2,FALSE)=\"\",\"N/A\",VLOOKUP(C39,Reference!$A$3:$B$188,2,FALSE)),\"\")","v":0.24000000000000002},null,null,null,"",null,null,null,null,null,null,null,null,"",null,null,null,null,null,null,{"$f":"IF(C39<>\"\",IF(VLOOKUP(C39,Reference!$I$3:$J$188,2,FALSE)=\" \",0,VLOOKUP(C39,Reference!$I$3:$J$188,2,FALSE)),\"\")","v":2},{"$f":"IF(C39<>\"\",IF(VLOOKUP(C39,Reference!$M$3:$Q$188,5,FALSE)=\" \",0,VLOOKUP(C39,Reference!$M$3:$Q$188,5,FALSE)),\"\")","v":"Y"}]
[null,null,"Total Zinc",null,null,null,null,null,null,null,null,null,null,null,null,null,null,null,null,{"$f":"IF(C40<>\"\",IF(VLOOKUP(C40,Reference!$A$3:$B$188,2,FALSE)=\"\",\"N/A\",VLOOKUP(C40,Reference!$A$3:$B$188,2,FALSE)),\"\")","v":119.8},null,null,null,"",null,null,null,null,null,null,null,null,"",null,null,null,null,null,null,{"$f":"IF(C40<>\"\",IF(VLOOKUP(C40,Reference!$I$3:$J$188,2,FALSE)=\" \",0,VLOOKUP(C40,Reference!$I$3:$J$188,2,FALSE)),\"\")","v":5},{"$f":"IF(C40<>\"\",IF(VLOOKUP(C40,Reference!$M$3:$Q$188,5,FALSE)=\" \",0,VLOOKUP(C40,Reference!$M$3:$Q$188,5,FALSE)),\"\")","v":"Y"}]
[null,"Group 3","Acrolein",null,null,null,null,null,null,null,null,null,"<",null,null,null,null,null,null,{"$f":"IF(C41<>\"\",IF(VLOOKUP(C41,Reference!$A$3:$B$188,2,FALSE)=\"\",\"N/A\",VLOOKUP(C41,Reference!$A$3:$B$188,2,FALSE)),\"\")","v":3},null,null,null,"",null,null,null,null,null,null,null,null,"",null,null,null,null,null,null,{"$f":"IF(C41<>\"\",IF(VLOOKUP(C41,Reference!$I$3:$J$188,2,FALSE)=\" \",0,VLOOKUP(C41,Reference!$I$3:$J$188,2,FALSE)),\"\")","v":2},{"$f":"IF(C41<>\"\",IF(VLOOKUP(C41,Reference!$M$3:$Q$188,5,FALSE)=\" \",0,VLOOKUP(C41,Reference!$M$3:$Q$188,5,FALSE)),\"\")","v":0}]
[null,null,"Acrylamide",null,null,null,null,null,null,null,null,null,"<",null,null,null,null,null,null,{"$f":"IF(C42<>\"\",IF(VLOOKUP(C42,Reference!$A$3:$B$188,2,FALSE)=\"\",\"N/A\",VLOOKUP(C42,Reference!$A$3:$B$188,2,FALSE)),\"\")","v":7.0000000000000007E-2},null,null,null,"",null,null,null,null,null,null,null,null,"",null,null,null,null,null,null,5,{"$f":"IF(C42<>\"\",IF(VLOOKUP(C42,Reference!$M$3:$Q$188,5,FALSE)=\" \",0,VLOOKUP(C42,Reference!$M$3:$Q$188,5,FALSE)),\"\")","v":0}]
[null,null,"Acrylonitrile",null,null,null,null,null,null,null,null,null,"<",null,null,null,null,null,null,{"$f":"IF(C43<>\"\",IF(VLOOKUP(C43,Reference!$A$3:$B$188,2,FALSE)=\"\",\"N/A\",VLOOKUP(C43,Reference!$A$3:$B$188,2,FALSE)),\"\")","v":5.0999999999999997E-2},null,null,null,"",null,null,null,null,null,null,null,null,"",null,null,null,null,null,null,{"$f":"IF(C43<>\"\",IF(VLOOKUP(C43,Reference!$I$3:$J$188,2,FALSE)=\" \",0,VLOOKUP(C43,Reference!$I$3:$J$188,2,FALSE)),\"\")","v":5},{"$f":"IF(C43<>\"\",IF(VLOOKUP(C43,Reference!$M$3:$Q$188,5,FALSE)=\" \",0,VLOOKUP(C43,Reference!$M$3:$Q$188,5,FALSE)),\"\")","v":0}]
[null,null,"Benzene",null,null,null,null,null,null,null,null,null,"<",null,null,null,null,null,null,{"$f":"IF(C44<>\"\",IF(VLOOKUP(C44,Reference!$A$3:$B$188,2,FALSE)=\"\",\"N/A\",VLOOKUP(C44,Reference!$A$3:$B$188,2,FALSE)),\"\")","v":1.2},null,null,null,"",null,null,null,null,null,null,null,null,"",null,null,null,null,null,null,{"$f":"IF(C44<>\"\",IF(VLOOKUP(C44,Reference!$I$3:$J$188,2,FALSE)=\" \",0,VLOOKUP(C44,Reference!$I$3:$J$188,2,FALSE)),\"\")","v":0.5},{"$f":"IF(C44<>\"\",IF(VLOOKUP(C44,Reference!$M$3:$Q$188,5,FALSE)=\" \",0,VLOOKUP(C44,Reference!$M$3:$Q$188,5,FALSE)),\"\")","v":0}]
[null,null,"Bromoform",null,null,null,null,null,null,null,null,null,"<",null,null,null,null,null,null,{"$f":"IF(C45<>\"\",IF(VLOOKUP(C45,Reference!$A$3:$B$188,2,FALSE)=\"\",\"N/A\",VLOOKUP(C45,Reference!$A$3:$B$188,2,FALSE)),\"\")","v":4.3},null,null,null,"",null,null,null,null,null,null,null,null,"",null,null,null,null,null,null,{"$f":"IF(C45<>\"\",IF(VLOOKUP(C45,Reference!$I$3:$J$188,2,FALSE)=\" \",0,VLOOKUP(C45,Reference!$I$3:$J$188,2,FALSE)),\"\")","v":0.5},{"$f":"IF(C45<>\"\",IF(VLOOKUP(C45,Reference!$M$3:$Q$188,5,FALSE)=\" \",0,VLOOKUP(C45,Reference!$M$3:$Q$188,5,FALSE)),\"\")","v":0}]
[null,null,"Carbon Tetrachloride",null,null,null,null,null,null,null,null,null,"<",null,null,null,null,null,null,{"$f":"IF(C46<>\"\",IF(VLOOKUP(C46,Reference!$A$3:$B$188,2,FALSE)=\"\",\"N/A\",VLOOKUP(C46,Reference!$A$3:$B$188,2,FALSE)),\"\")","v":0.23},null,null,null,"",null,null,null,null,null,null,null,null,"",null,null,null,null,null,null,{"$f":"IF(C46<>\"\",IF(VLOOKUP(C46,Reference!$I$3:$J$188,2,FALSE)=\" \",0,VLOOKUP(C46,Reference!$I$3:$J$188,2,FALSE)),\"\")","v":0.5},{"$f":"IF(C46<>\"\",IF(VLOOKUP(C46,Reference!$M$3:$Q$188,5,FALSE)=\" \",0,VLOOKUP(C46,Reference!$M$3:$Q$188,5,FALSE)),\"\")","v":0}]
[null,null,"Chlorobenzene",null,null,null,null,null,null,null,null,null,"<",null,null,null,null,null,null,{"$f":"IF(C47<>\"\",IF(VLOOKUP(C47,Reference!$A$3:$B$188,2,FALSE)=\"\",\"N/A\",VLOOKUP(C47,Reference!$A$3:$B$188,2,FALSE)),\"\")","v":130},null,null,null,"",null,null,null,null,null,null,null,null,"",null,null,null,null,null,null,{"$f":"IF(C47<>\"\",IF(VLOOKUP(C47,Reference!$I$3:$J$188,2,FALSE)=\" \",0,VLOOKUP(C47,Reference!$I$3:$J$188,2,FALSE)),\"\")","v":0.5},{"$f":"IF(C47<>\"\",IF(VLOOKUP(C47,Reference!$M$3:$Q$188,5,FALSE)=\" \",0,VLOOKUP(C47,Reference!$M$3:$Q$188,5,FALSE)),\"\")","v":0}]
[null,null,"Chlorodibromomethane",null,null,null,null,null,null,null,null,null,"<",null,null,null,null,null,null,{"$f":"IF(C48<>\"\",IF(VLOOKUP(C48,Reference!$A$3:$B$188,2,FALSE)=\"\",\"N/A\",VLOOKUP(C48,Reference!$A$3:$B$188,2,FALSE)),\"\")","v":0.4},null,null,null,"",null,null,null,null,null,null,null,null,"",null,null,null,null,null,null,{"$f":"IF(C48<>\"\",IF(VLOOKUP(C48,Reference!$I$3:$J$188,2,FALSE)=\" \",0,VLOOKUP(C48,Reference!$I$3:$J$188,2,FALSE)),\"\")","v":0.5},{"$f":"IF(C48<>\"\",IF(VLOOKUP(C48,Reference!$M$3:$Q$188,5,FALSE)=\" \",0,VLOOKUP(C48,Reference!$M$3:$Q$188,5,FALSE)),\"\")","v":0}]
[null,null,"Chloroethane",null,null,null,null,null,null,null,null,null,"<",null,null,null,null,null,null,{"$f":"IF(C49<>\"\",IF(VLOOKUP(C49,Reference!$A$3:$B$188,2,FALSE)=\"\",\"N/A\",VLOOKUP(C49,Reference!$A$3:$B$188,2,FALSE)),\"\")","v":"N/A"},null,null,null,"",null,null,null,null,null,null,null,null,"",null,null,null,null,null,null,{"$f":"IF(C49<>\"\",IF(VLOOKUP(C49,Reference!$I$3:$J$188,2,FALSE)=\" \",0,VLOOKUP(C49,Reference!$I$3:$J$188,2,FALSE)),\"\")","v":0.5},{"$f":"IF(C49<>\"\",IF(VLOOKUP(C49,Reference!$M$3:$Q$188,5,FALSE)=\" \",0,VLOOKUP(C49,Reference!$M$3:$Q$188,5,FALSE)),\"\")","v":0}]
[null,null,"2-Chloroethyl Vinyl Ether",null,null,null,null,null,null,null,null,null,"<",null,null,null,null,null,null,{"$f":"IF(C50<>\"\",IF(VLOOKUP(C50,Reference!$A$3:$B$188,2,FALSE)=\"\",\"N/A\",VLOOKUP(C50,Reference!$A$3:$B$188,2,FALSE)),\"\")","v":3500},null,null,null,"",null,null,null,null,null,null,null,null,"",null,null,null,null,null,null,{"$f":"IF(C50<>\"\",IF(VLOOKUP(C50,Reference!$I$3:$J$188,2,FALSE)=\" \",0,VLOOKUP(C50,Reference!$I$3:$J$188,2,FALSE)),\"\")","v":5},{"$f":"IF(C50<>\"\",IF(VLOOKUP(C50,Reference!$M$3:$Q$188,5,FALSE)=\" \",0,VLOOKUP(C50,Reference!$M$3:$Q$188,5,FALSE)),\"\")","v":0}]
[null,null,"Chloroform",null,null,null,null,null,null,null,null,null,"<",null,null,null,null,null,null,{"$f":"IF(C51<>\"\",IF(VLOOKUP(C51,Reference!$A$3:$B$188,2,FALSE)=\"\",\"N/A\",VLOOKUP(C51,Reference!$A$3:$B$188,2,FALSE)),\"\")","v":5.7},null,null,null,"",null,null,null,null,null,null,null,null,"",null,null,null,null,null,null,{"$f":"IF(C51<>\"\",IF(VLOOKUP(C51,Reference!$I$3:$J$188,2,FALSE)=\" \",0,VLOOKUP(C51,Reference!$I$3:$J$188,2,FALSE)),\"\")","v":0.5},{"$f":"IF(C51<>\"\",IF(VLOOKUP(C51,Reference!$M$3:$Q$188,5,FALSE)=\" \",0,VLOOKUP(C51,Reference!$M$3:$Q$188,5,FALSE)),\"\")","v":0}]
[null,null,"Dichlorobromomethane",null,null,null,null,null,null,null,null,null,"<",null,null,null,null,null,null,{"$f":"IF(C52<>\"\",IF(VLOOKUP(C52,Reference!$A$3:$B$188,2,FALSE)=\"\",\"N/A\",VLOOKUP(C52,Reference!$A$3:$B$188,2,FALSE)),\"\")","v":0.55000000000000004},null,null,null,"",null,null,null,null,null,null,null,null,"",null,null,null,null,null,null,{"$f":"IF(C52<>\"\",IF(VLOOKUP(C52,Reference!$I$3:$J$188,2,FALSE)=\" \",0,VLOOKUP(C52,Reference!$I$3:$J$188,2,FALSE)),\"\")","v":0.5},{"$f":"IF(C52<>\"\",IF(VLOOKUP(C52,Reference!$M$3:$Q$188,5,FALSE)=\" \",0,VLOOKUP(C52,Reference!$M$3:$Q$188,5,FALSE)),\"\")","v":0}]
[null,null,"1,1-Dichloroethane",null,null,null,null,null,null,null,null,null,"<",null,null,null,null,null,null,{"$f":"IF(C53<>\"\",IF(VLOOKUP(C53,Reference!$A$3:$B$188,2,FALSE)=\"\",\"N/A\",VLOOKUP(C53,Reference!$A$3:$B$188,2,FALSE)),\"\")","v":"N/A"},null,null,null,"",null,null,null,null,null,null,null,null,"",null,null,null,null,null,null,{"$f":"IF(C53<>\"\",IF(VLOOKUP(C53,Reference!$I$3:$J$188,2,FALSE)=\" \",0,VLOOKUP(C53,Reference!$I$3:$J$188,2,FALSE)),\"\")","v":0.5},{"$f":"IF(C53<>\"\",IF(VLOOKUP(C53,Reference!$M$3:$Q$188,5,FALSE)=\" \",0,VLOOKUP(C53,Reference!$M$3:$Q$188,5,FALSE)),\"\")","v":0}]
[null,null,"1,2-Dichloroethane",null,null,null,null,null,null,null,null,null,"<",null,null,null,null,null,null,{"$f":"IF(C54<>\"\",IF(VLOOKUP(C54,Reference!$A$3:$B$188,2,FALSE)=\"\",\"N/A\",VLOOKUP(C54,Reference!$A$3:$B$188,2,FALSE)),\"\")","v":0.38},null,null,null,"",null,null,null,null,null,null,null,null,"",null,null,null,null,null,null,{"$f":"IF(C54<>\"\",IF(VLOOKUP(C54,Reference!$I$3:$J$188,2,FALSE)=\" \",0,VLOOKUP(C54,Reference!$I$3:$J$188,2,FALSE)),\"\")","v":0.5},{"$f":"IF(C54<>\"\",IF(VLOOKUP(C54,Reference!$M$3:$Q$188,5,FALSE)=\" \",0,VLOOKUP(C54,Reference!$M$3:$Q$188,5,FALSE)),\"\")","v":0}]
[null,null,"1,1-Dichloroethylene",null,null,null,null,null,null,null,null,null,"<",null,null,null,null,null,null,{"$f":"IF(C55<>\"\",IF(VLOOKUP(C55,Reference!$A$3:$B$188,2,FALSE)=\"\",\"N/A\",VLOOKUP(C55,Reference!$A$3:$B$188,2,FALSE)),\"\")","v":33},null,null,null,"",null,null,null,null,null,null,null,null,"",null,null,null,null,null,null,{"$f":"IF(C55<>\"\",IF(VLOOKUP(C55,Reference!$I$3:$J$188,2,FALSE)=\" \",0,VLOOKUP(C55,Reference!$I$3:$J$188,2,FALSE)),\"\")","v":0.5},{"$f":"IF(C55<>\"\",IF(VLOOKUP(C55,Reference!$M$3:$Q$188,5,FALSE)=\" \",0,VLOOKUP(C55,Reference!$M$3:$Q$188,5,FALSE)),\"\")","v":0}]
[null,null,"1,2-Dichloropropane",null,null,null,null,null,null,null,null,null,"<",null,null,null,null,null,null,{"$f":"IF(C56<>\"\",IF(VLOOKUP(C56,Reference!$A$3:$B$188,2,FALSE)=\"\",\"N/A\",VLOOKUP(C56,Reference!$A$3:$B$188,2,FALSE)),\"\")","v":2200},null,null,null,"",null,null,null,null,null,null,null,null,"",null,null,null,null,null,null,{"$f":"IF(C56<>\"\",IF(VLOOKUP(C56,Reference!$I$3:$J$188,2,FALSE)=\" \",0,VLOOKUP(C56,Reference!$I$3:$J$188,2,FALSE)),\"\")","v":0.5},{"$f":"IF(C56<>\"\",IF(VLOOKUP(C56,Reference!$M$3:$Q$188,5,FALSE)=\" \",0,VLOOKUP(C56,Reference!$M$3:$Q$188,5,FALSE)),\"\")","v":0}]
[null,null,"1,3-Dichloropropylene",null,null,null,null,null,null,null,null,null,"<",null,null,null,null,null,null,{"$f":"IF(C57<>\"\",IF(VLOOKUP(C57,Reference!$A$3:$B$188,2,FALSE)=\"\",\"N/A\",VLOOKUP(C57,Reference!$A$3:$B$188,2,FALSE)),\"\")","v":0.34},null,null,null,"",null,null,null,null,null,null,null,null,"",null,null,null,null,null,null,{"$f":"IF(C57<>\"\",IF(VLOOKUP(C57,Reference!$I$3:$J$188,2,FALSE)=\" \",0,VLOOKUP(C57,Reference!$I$3:$J$188,2,FALSE)),\"\")","v":0.5},{"$f":"IF(C57<>\"\",IF(VLOOKUP(C57,Reference!$M$3:$Q$188,5,FALSE)=\" \",0,VLOOKUP(C57,Reference!$M$3:$Q$188,5,FALSE)),\"\")","v":0}]
[null,null,"Ethylbenzene",null,null,null,null,null,null,null,null,null,"<",null,null,null,null,null,null,{"$f":"IF(C58<>\"\",IF(VLOOKUP(C58,Reference!$A$3:$B$188,2,FALSE)=\"\",\"N/A\",VLOOKUP(C58,Reference!$A$3:$B$188,2,FALSE)),\"\")","v":530},null,null,null,"",null,null,null,null,null,null,null,null,"",null,null,null,null,null,null,{"$f":"IF(C58<>\"\",IF(VLOOKUP(C58,Reference!$I$3:$J$188,2,FALSE)=\" \",0,VLOOKUP(C58,Reference!$I$3:$J$188,2,FALSE)),\"\")","v":0.5},{"$f":"IF(C58<>\"\",IF(VLOOKUP(C58,Reference!$M$3:$Q$188,5,FALSE)=\" \",0,VLOOKUP(C58,Reference!$M$3:$Q$188,5,FALSE)),\"\")","v":0}]
[null,null,"Methyl Bromide",null,null,null,null,null,null,null,null,null,"<",null,null,null,null,null,null,{"$f":"IF(C59<>\"\",IF(VLOOKUP(C59,Reference!$A$3:$B$188,2,FALSE)=\"\",\"N/A\",VLOOKUP(C59,Reference!$A$3:$B$188,2,FALSE)),\"\")","v":47},null,null,null,"",null,null,null,null,null,null,null,null,"",null,null,null,null,null,null,{"$f":"IF(C59<>\"\",IF(VLOOKUP(C59,Reference!$I$3:$J$188,2,FALSE)=\" \",0,VLOOKUP(C59,Reference!$I$3:$J$188,2,FALSE)),\"\")","v":0.5},{"$f":"IF(C59<>\"\",IF(VLOOKUP(C59,Reference!$M$3:$Q$188,5,FALSE)=\" \",0,VLOOKUP(C59,Reference!$M$3:$Q$188,5,FALSE)),\"\")","v":0}]
[null,null,"Methyl Chloride",null,null,null,null,null,null,null,null,null,"<",null,null,null,null,null,null,{"$f":"IF(C60<>\"\",IF(VLOOKUP(C60,Reference!$A$3:$B$188,2,FALSE)=\"\",\"N/A\",VLOOKUP(C60,Reference!$A$3:$B$188,2,FALSE)),\"\")","v":5500},null,null,null,"",null,null,null,null,null,null,null,null,"",null,null,null,null,null,null,{"$f":"IF(C60<>\"\",IF(VLOOKUP(C60,Reference!$I$3:$J$188,2,FALSE)=\" \",0,VLOOKUP(C60,Reference!$I$3:$J$188,2,FALSE)),\"\")","v":0.5},{"$f":"IF(C60<>\"\",IF(VLOOKUP(C60,Reference!$M$3:$Q$188,5,FALSE)=\" \",0,VLOOKUP(C60,Reference!$M$3:$Q$188,5,FALSE)),\"\")","v":0}]
[null,null,"Methylene Chloride",null,null,null,null,null,null,null,null,null,"<",null,null,null,null,null,null,{"$f":"IF(C61<>\"\",IF(VLOOKUP(C61,Reference!$A$3:$B$188,2,FALSE)=\"\",\"N/A\",VLOOKUP(C61,Reference!$A$3:$B$188,2,FALSE)),\"\")","v":4.5999999999999996},null,null,null,"",null,null,null,null,null,null,null,null,"",null,null,null,null,null,null,{"$f":"IF(C61<>\"\",IF(VLOOKUP(C61,Reference!$I$3:$J$188,2,FALSE)=\" \",0,VLOOKUP(C61,Reference!$I$3:$J$188,2,FALSE)),\"\")","v":0.5},{"$f":"IF(C61<>\"\",IF(VLOOKUP(C61,Reference!$M$3:$Q$188,5,FALSE)=\" \",0,VLOOKUP(C61,Reference!$M$3:$Q$188,5,FALSE)),\"\")","v":0}]
[null,null,"1,1,2,2-Tetrachloroethane",null,null,null,null,null,null,null,null,null,"<",null,null,null,null,null,null,{"$f":"IF(C62<>\"\",IF(VLOOKUP(C62,Reference!$A$3:$B$188,2,FALSE)=\"\",\"N/A\",VLOOKUP(C62,Reference!$A$3:$B$188,2,FALSE)),\"\")","v":0.17},null,null,null,"",null,null,null,null,null,null,null,null,"",null,null,null,null,null,null,{"$f":"IF(C62<>\"\",IF(VLOOKUP(C62,Reference!$I$3:$J$188,2,FALSE)=\" \",0,VLOOKUP(C62,Reference!$I$3:$J$188,2,FALSE)),\"\")","v":0.5},{"$f":"IF(C62<>\"\",IF(VLOOKUP(C62,Reference!$M$3:$Q$188,5,FALSE)=\" \",0,VLOOKUP(C62,Reference!$M$3:$Q$188,5,FALSE)),\"\")","v":0}]
[null,null,"Tetrachloroethylene",null,null,null,null,null,null,null,null,null,"<",null,null,null,null,null,null,{"$f":"IF(C63<>\"\",IF(VLOOKUP(C63,Reference!$A$3:$B$188,2,FALSE)=\"\",\"N/A\",VLOOKUP(C63,Reference!$A$3:$B$188,2,FALSE)),\"\")","v":0.69},null,null,null,"",null,null,null,null,null,null,null,null,"",null,null,null,null,null,null,{"$f":"IF(C63<>\"\",IF(VLOOKUP(C63,Reference!$I$3:$J$188,2,FALSE)=\" \",0,VLOOKUP(C63,Reference!$I$3:$J$188,2,FALSE)),\"\")","v":0.5},{"$f":"IF(C63<>\"\",IF(VLOOKUP(C63,Reference!$M$3:$Q$188,5,FALSE)=\" \",0,VLOOKUP(C63,Reference!$M$3:$Q$188,5,FALSE)),\"\")","v":0}]
[null,null,"Toluene",null,null,null,null,null,null,null,null,null,"<",null,null,null,null,null,null,{"$f":"IF(C64<>\"\",IF(VLOOKUP(C64,Reference!$A$3:$B$188,2,FALSE)=\"\",\"N/A\",VLOOKUP(C64,Reference!$A$3:$B$188,2,FALSE)),\"\")","v":330},null,null,null,"",null,null,null,null,null,null,null,null,"",null,null,null,null,null,null,{"$f":"IF(C64<>\"\",IF(VLOOKUP(C64,Reference!$I$3:$J$188,2,FALSE)=\" \",0,VLOOKUP(C64,Reference!$I$3:$J$188,2,FALSE)),\"\")","v":0.5},{"$f":"IF(C64<>\"\",IF(VLOOKUP(C64,Reference!$M$3:$Q$188,5,FALSE)=\" \",0,VLOOKUP(C64,Reference!$M$3:$Q$188,5,FALSE)),\"\")","v":0}]
[null,null,"1,2-trans-Dichloroethylene",null,null,null,null,null,null,null,null,null,"<",null,null,null,null,null,null,{"$f":"IF(C65<>\"\",IF(VLOOKUP(C65,Reference!$A$3:$B$188,2,FALSE)=\"\",\"N/A\",VLOOKUP(C65,Reference!$A$3:$B$188,2,FALSE)),\"\")","v":140},null,null,null,"",null,null,null,null,null,null,null,null,"",null,null,null,null,null,null,{"$f":"IF(C65<>\"\",IF(VLOOKUP(C65,Reference!$I$3:$J$188,2,FALSE)=\" \",0,VLOOKUP(C65,Reference!$I$3:$J$188,2,FALSE)),\"\")","v":0.5},{"$f":"IF(C65<>\"\",IF(VLOOKUP(C65,Reference!$M$3:$Q$188,5,FALSE)=\" \",0,VLOOKUP(C65,Reference!$M$3:$Q$188,5,FALSE)),\"\")","v":0}]
[null,null,"1,1,1-Trichloroethane",null,null,null,null,null,null,null,null,null,"<",null,null,null,null,null,null,{"$f":"IF(C66<>\"\",IF(VLOOKUP(C66,Reference!$A$3:$B$188,2,FALSE)=\"\",\"N/A\",VLOOKUP(C66,Reference!$A$3:$B$188,2,FALSE)),\"\")","v":610},null,null,null,"",null,null,null,null,null,null,null,null,"",null,null,null,null,null,null,{"$f":"IF(C66<>\"\",IF(VLOOKUP(C66,Reference!$I$3:$J$188,2,FALSE)=\" \",0,VLOOKUP(C66,Reference!$I$3:$J$188,2,FALSE)),\"\")","v":0.5},{"$f":"IF(C66<>\"\",IF(VLOOKUP(C66,Reference!$M$3:$Q$188,5,FALSE)=\" \",0,VLOOKUP(C66,Reference!$M$3:$Q$188,5,FALSE)),\"\")","v":0}]
[null,null,"1,1,2-Trichloroethane",null,null,null,null,null,null,null,null,null,"<",null,null,null,null,null,null,{"$f":"IF(C67<>\"\",IF(VLOOKUP(C67,Reference!$A$3:$B$188,2,FALSE)=\"\",\"N/A\",VLOOKUP(C67,Reference!$A$3:$B$188,2,FALSE)),\"\")","v":0.59000000000000008},null,null,null,"",null,null,null,null,null,null,null,null,"",null,null,null,null,null,null,{"$f":"IF(C67<>\"\",IF(VLOOKUP(C67,Reference!$I$3:$J$188,2,FALSE)=\" \",0,VLOOKUP(C67,Reference!$I$3:$J$188,2,FALSE)),\"\")","v":0.5},{"$f":"IF(C67<>\"\",IF(VLOOKUP(C67,Reference!$M$3:$Q$188,5,FALSE)=\" \",0,VLOOKUP(C67,Reference!$M$3:$Q$188,5,FALSE)),\"\")","v":0}]
[null,null,"Trichloroethylene",null,null,null,null,null,null,null,null,null,"<",null,null,null,null,null,null,{"$f":"IF(C68<>\"\",IF(VLOOKUP(C68,Reference!$A$3:$B$188,2,FALSE)=\"\",\"N/A\",VLOOKUP(C68,Reference!$A$3:$B$188,2,FALSE)),\"\")","v":2.5},null,null,null,"",null,null,null,null,null,null,null,null,"",null,null,null,null,null,null,{"$f":"IF(C68<>\"\",IF(VLOOKUP(C68,Reference!$I$3:$J$188,2,FALSE)=\" \",0,VLOOKUP(C68,Reference!$I$3:$J$188,2,FALSE)),\"\")","v":0.5},{"$f":"IF(C68<>\"\",IF(VLOOKUP(C68,Reference!$M$3:$Q$188,5,FALSE)=\" \",0,VLOOKUP(C68,Reference!$M$3:$Q$188,5,FALSE)),\"\")","v":0}]
[null,null,"Vinyl Chloride",null,null,null,null,null,null,null,null,null,"<",null,null,null,null,null,null,{"$f":"IF(C69<>\"\",IF(VLOOKUP(C69,Reference!$A$3:$B$188,2,FALSE)=\"\",\"N/A\",VLOOKUP(C69,Reference!$A$3:$B$188,2,FALSE)),\"\")","v":2.5000000000000001E-2},null,null,null,"",null,null,null,null,null,null,null,null,"",null,null,null,null,null,null,{"$f":"IF(C69<>\"\",IF(VLOOKUP(C69,Reference!$I$3:$J$188,2,FALSE)=\" \",0,VLOOKUP(C69,Reference!$I$3:$J$188,2,FALSE)),\"\")","v":0.5},{"$f":"IF(C69<>\"\",IF(VLOOKUP(C69,Reference!$M$3:$Q$188,5,FALSE)=\" \",0,VLOOKUP(C69,Reference!$M$3:$Q$188,5,FALSE)),\"\")","v":0}]
[null,"Group 4","2-Chlorophenol",null,null,null,null,null,null,null,null,null,"<",null,null,null,null,null,null,{"$f":"IF(C70<>\"\",IF(VLOOKUP(C70,Reference!$A$3:$B$188,2,FALSE)=\"\",\"N/A\",VLOOKUP(C70,Reference!$A$3:$B$188,2,FALSE)),\"\")","v":81},null,null,null,"",null,null,null,null,null,null,null,null,"",null,null,null,null,null,null,{"$f":"IF(C70<>\"\",IF(VLOOKUP(C70,Reference!$I$3:$J$188,2,FALSE)=\" \",0,VLOOKUP(C70,Reference!$I$3:$J$188,2,FALSE)),\"\")","v":10},{"$f":"IF(C70<>\"\",IF(VLOOKUP(C70,Reference!$M$3:$Q$188,5,FALSE)=\" \",0,VLOOKUP(C70,Reference!$M$3:$Q$188,5,FALSE)),\"\")","v":0}]
[null,null,"2,4-Dichlorophenol",null,null,null,null,null,null,null,null,null,"<",null,null,null,null,null,null,{"$f":"IF(C71<>\"\",IF(VLOOKUP(C71,Reference!$A$3:$B$188,2,FALSE)=\"\",\"N/A\",VLOOKUP(C71,Reference!$A$3:$B$188,2,FALSE)),\"\")","v":77},null,null,null,"",null,null,null,null,null,null,null,null,"",null,null,null,null,null,null,{"$f":"IF(C71<>\"\",IF(VLOOKUP(C71,Reference!$I$3:$J$188,2,FALSE)=\" \",0,VLOOKUP(C71,Reference!$I$3:$J$188,2,FALSE)),\"\")","v":10},{"$f":"IF(C71<>\"\",IF(VLOOKUP(C71,Reference!$M$3:$Q$188,5,FALSE)=\" \",0,VLOOKUP(C71,Reference!$M$3:$Q$188,5,FALSE)),\"\")","v":0}]
[null,null,"2,4-Dimethylphenol",null,null,null,null,null,null,null,null,null,"<",null,null,null,null,null,null,{"$f":"IF(C72<>\"\",IF(VLOOKUP(C72,Reference!$A$3:$B$188,2,FALSE)=\"\",\"N/A\",VLOOKUP(C72,Reference!$A$3:$B$188,2,FALSE)),\"\")","v":130},null,null,null,"",null,null,null,null,null,null,null,null,"",null,null,null,null,null,null,{"$f":"IF(C72<>\"\",IF(VLOOKUP(C72,Reference!$I$3:$J$188,2,FALSE)=\" \",0,VLOOKUP(C72,Reference!$I$3:$J$188,2,FALSE)),\"\")","v":10},{"$f":"IF(C72<>\"\",IF(VLOOKUP(C72,Reference!$M$3:$Q$188,5,FALSE)=\" \",0,VLOOKUP(C72,Reference!$M$3:$Q$188,5,FALSE)),\"\")","v":0}]
[null,null,"4,6-Dinitro-o-Cresol",null,null,null,null,null,null,null,null,null,"<",null,null,null,null,null,null,{"$f":"IF(C73<>\"\",IF(VLOOKUP(C73,Reference!$A$3:$B$188,2,FALSE)=\"\",\"N/A\",VLOOKUP(C73,Reference!$A$3:$B$188,2,FALSE)),\"\")","v":13},null,null,null,"",null,null,null,null,null,null,null,null,"",null,null,null,null,null,null,{"$f":"IF(C73<>\"\",IF(VLOOKUP(C73,Reference!$I$3:$J$188,2,FALSE)=\" \",0,VLOOKUP(C73,Reference!$I$3:$J$188,2,FALSE)),\"\")","v":10},{"$f":"IF(C73<>\"\",IF(VLOOKUP(C73,Reference!$M$3:$Q$188,5,FALSE)=\" \",0,VLOOKUP(C73,Reference!$M$3:$Q$188,5,FALSE)),\"\")","v":0}]
[null,null,"2,4-Dinitrophenol",null,null,null,null,null,null,null,null,null,"<",null,null,null,null,null,null,{"$f":"IF(C74<>\"\",IF(VLOOKUP(C74,Reference!$A$3:$B$188,2,FALSE)=\"\",\"N/A\",VLOOKUP(C74,Reference!$A$3:$B$188,2,FALSE)),\"\")","v":69},null,null,null,"",null,null,null,null,null,null,null,null,"",null,null,null,null,null,null,{"$f":"IF(C74<>\"\",IF(VLOOKUP(C74,Reference!$I$3:$J$188,2,FALSE)=\" \",0,VLOOKUP(C74,Reference!$I$3:$J$188,2,FALSE)),\"\")","v":10},{"$f":"IF(C74<>\"\",IF(VLOOKUP(C74,Reference!$M$3:$Q$188,5,FALSE)=\" \",0,VLOOKUP(C74,Reference!$M$3:$Q$188,5,FALSE)),\"\")","v":0}]
[null,null,"2-Nitrophenol",null,null,null,null,null,null,null,null,null,"<",null,null,null,null,null,null,{"$f":"IF(C75<>\"\",IF(VLOOKUP(C75,Reference!$A$3:$B$188,2,FALSE)=\"\",\"N/A\",VLOOKUP(C75,Reference!$A$3:$B$188,2,FALSE)),\"\")","v":1600},null,null,null,"",null,null,null,null,null,null,null,null,"",null,null,null,null,null,null,{"$f":"IF(C75<>\"\",IF(VLOOKUP(C75,Reference!$I$3:$J$188,2,FALSE)=\" \",0,VLOOKUP(C75,Reference!$I$3:$J$188,2,FALSE)),\"\")","v":10},{"$f":"IF(C75<>\"\",IF(VLOOKUP(C75,Reference!$M$3:$Q$188,5,FALSE)=\" \",0,VLOOKUP(C75,Reference!$M$3:$Q$188,5,FALSE)),\"\")","v":0}]
[null,null,"4-Nitrophenol",null,null,null,null,null,null,null,null,null,"<",null,null,null,null,null,null,{"$f":"IF(C76<>\"\",IF(VLOOKUP(C76,Reference!$A$3:$B$188,2,FALSE)=\"\",\"N/A\",VLOOKUP(C76,Reference!$A$3:$B$188,2,FALSE)),\"\")","v":470},null,null,null,"",null,null,null,null,null,null,null,null,"",null,null,null,null,null,null,{"$f":"IF(C76<>\"\",IF(VLOOKUP(C76,Reference!$I$3:$J$188,2,FALSE)=\" \",0,VLOOKUP(C76,Reference!$I$3:$J$188,2,FALSE)),\"\")","v":10},{"$f":"IF(C76<>\"\",IF(VLOOKUP(C76,Reference!$M$3:$Q$188,5,FALSE)=\" \",0,VLOOKUP(C76,Reference!$M$3:$Q$188,5,FALSE)),\"\")","v":0}]
[null,null,"p-Chloro-m-Cresol",null,null,null,null,null,null,null,null,null,"<",null,null,null,null,null,null,{"$f":"IF(C77<>\"\",IF(VLOOKUP(C77,Reference!$A$3:$B$188,2,FALSE)=\"\",\"N/A\",VLOOKUP(C77,Reference!$A$3:$B$188,2,FALSE)),\"\")","v":30},null,null,null,"",null,null,null,null,null,null,null,null,"",null,null,null,null,null,null,{"$f":"IF(C77<>\"\",IF(VLOOKUP(C77,Reference!$I$3:$J$188,2,FALSE)=\" \",0,VLOOKUP(C77,Reference!$I$3:$J$188,2,FALSE)),\"\")","v":10},{"$f":"IF(C77<>\"\",IF(VLOOKUP(C77,Reference!$M$3:$Q$188,5,FALSE)=\" \",0,VLOOKUP(C77,Reference!$M$3:$Q$188,5,FALSE)),\"\")","v":0}]
[null,null,"Pentachlorophenol",null,null,null,null,null,null,null,null,null,"<",null,null,null,null,null,null,{"$f":"IF(C78<>\"\",IF(VLOOKUP(C78,Reference!$A$3:$B$188,2,FALSE)=\"\",\"N/A\",VLOOKUP(C78,Reference!$A$3:$B$188,2,FALSE)),\"\")","v":0.27},null,null,null,"",null,null,null,null,null,null,null,null,"",null,null,null,null,null,null,{"$f":"IF(C78<>\"\",IF(VLOOKUP(C78,Reference!$I$3:$J$188,2,FALSE)=\" \",0,VLOOKUP(C78,Reference!$I$3:$J$188,2,FALSE)),\"\")","v":10},{"$f":"IF(C78<>\"\",IF(VLOOKUP(C78,Reference!$M$3:$Q$188,5,FALSE)=\" \",0,VLOOKUP(C78,Reference!$M$3:$Q$188,5,FALSE)),\"\")","v":0}]
[null,null,"Phenol",null,null,null,null,null,null,null,null,null,"<",null,null,null,null,null,null,{"$f":"IF(C79<>\"\",IF(VLOOKUP(C79,Reference!$A$3:$B$188,2,FALSE)=\"\",\"N/A\",VLOOKUP(C79,Reference!$A$3:$B$188,2,FALSE)),\"\")","v":10400},null,null,null,"",null,null,null,null,null,null,null,null,"",null,null,null,null,null,null,{"$f":"IF(C79<>\"\",IF(VLOOKUP(C79,Reference!$I$3:$J$188,2,FALSE)=\" \",0,VLOOKUP(C79,Reference!$I$3:$J$188,2,FALSE)),\"\")","v":10},{"$f":"IF(C79<>\"\",IF(VLOOKUP(C79,Reference!$M$3:$Q$188,5,FALSE)=\" \",0,VLOOKUP(C79,Reference!$M$3:$Q$188,5,FALSE)),\"\")","v":0}]
[null,null,"2,4,6-Trichlorophenol",null,null,null,null,null,null,null,null,null,"<",null,null,null,null,null,null,{"$f":"IF(C80<>\"\",IF(VLOOKUP(C80,Reference!$A$3:$B$188,2,FALSE)=\"\",\"N/A\",VLOOKUP(C80,Reference!$A$3:$B$188,2,FALSE)),\"\")","v":1.4},null,null,null,"",null,null,null,null,null,null,null,null,"",null,null,null,null,null,null,{"$f":"IF(C80<>\"\",IF(VLOOKUP(C80,Reference!$I$3:$J$188,2,FALSE)=\" \",0,VLOOKUP(C80,Reference!$I$3:$J$188,2,FALSE)),\"\")","v":10},{"$f":"IF(C80<>\"\",IF(VLOOKUP(C80,Reference!$M$3:$Q$188,5,FALSE)=\" \",0,VLOOKUP(C80,Reference!$M$3:$Q$188,5,FALSE)),\"\")","v":0}]
[null,"Group 5","Acenaphthene",null,null,null,null,null,null,null,null,null,"<",null,null,null,null,null,null,{"$f":"IF(C81<>\"\",IF(VLOOKUP(C81,Reference!$A$3:$B$188,2,FALSE)=\"\",\"N/A\",VLOOKUP(C81,Reference!$A$3:$B$188,2,FALSE)),\"\")","v":17},null,null,null,"",null,null,null,null,null,null,null,null,"",null,null,null,null,null,null,{"$f":"IF(C81<>\"\",IF(VLOOKUP(C81,Reference!$I$3:$J$188,2,FALSE)=\" \",0,VLOOKUP(C81,Reference!$I$3:$J$188,2,FALSE)),\"\")","v":2.5},{"$f":"IF(C81<>\"\",IF(VLOOKUP(C81,Reference!$M$3:$Q$188,5,FALSE)=\" \",0,VLOOKUP(C81,Reference!$M$3:$Q$188,5,FALSE)),\"\")","v":0}]
[null,null,"Acenaphthylene",null,null,null,null,null,null,null,null,null,"<",null,null,null,null,null,null,{"$f":"IF(C82<>\"\",IF(VLOOKUP(C82,Reference!$A$3:$B$188,2,FALSE)=\"\",\"N/A\",VLOOKUP(C82,Reference!$A$3:$B$188,2,FALSE)),\"\")","v":"N/A"},null,null,null,{"$f":"IF(AND(C82<>\"\",N82<>\"\",$J$8<>\"\",$Z$7<>\"\"),IF(T82<>\"N/A\",IF(AND(N82<=VALUE(AN82),M82=\"<\"),\"No (Value < QL)\",IF($AP$9=\"No\",IF(N82>=(0.5*T82),IF(AND(M82=\"<\",N82=(0.5*T82)),\"No\",\"Yes\"),\"No\"),IF(N82>=T82,IF(AND(M82=\"<\",N82=T82),\"No\",\"Yes\"),\"No\"))),\"No\"),\"\")","v":""},null,null,null,null,null,null,null,null,{"$f":"IF($N82<>\"\",IF(AND(X82=\"Yes\",AC82<>\"\"),IF(($N82/$AC82)>=0.5,\"Establish Limits\",IF(AND($AO82=\"Y\",($N82/$AC82)>0.1),\"Monitor\",IF(AND($AO82<>\"Y\",($N82/$AC82)>0.25),\"Monitor\",\"No Limits/Monitoring\"))),\"\"),\"\")","v":""},null,null,null,null,null,null,{"$f":"IF(C82<>\"\",IF(VLOOKUP(C82,Reference!$I$3:$J$188,2,FALSE)=\" \",0,VLOOKUP(C82,Reference!$I$3:$J$188,2,FALSE)),\"\")","v":2.5},{"$f":"IF(C82<>\"\",IF(VLOOKUP(C82,Reference!$M$3:$Q$188,5,FALSE)=\" \",0,VLOOKUP(C82,Reference!$M$3:$Q$188,5,FALSE)),\"\")","v":0}]
[null,null,"Anthracene",null,null,null,null,null,null,null,null,null,"<",null,null,null,null,null,null,{"$f":"IF(C83<>\"\",IF(VLOOKUP(C83,Reference!$A$3:$B$188,2,FALSE)=\"\",\"N/A\",VLOOKUP(C83,Reference!$A$3:$B$188,2,FALSE)),\"\")","v":8300},null,null,null,"",null,null,null,null,null,null,null,null,"",null,null,null,null,null,null,{"$f":"IF(C83<>\"\",IF(VLOOKUP(C83,Reference!$I$3:$J$188,2,FALSE)=\" \",0,VLOOKUP(C83,Reference!$I$3:$J$188,2,FALSE)),\"\")","v":2.5},{"$f":"IF(C83<>\"\",IF(VLOOKUP(C83,Reference!$M$3:$Q$188,5,FALSE)=\" \",0,VLOOKUP(C83,Reference!$M$3:$Q$188,5,FALSE)),\"\")","v":0}]
[null,null,"Benzidine",null,null,null,null,null,null,null,null,null,"<",null,null,null,null,null,null,{"$f":"IF(C84<>\"\",IF(VLOOKUP(C84,Reference!$A$3:$B$188,2,FALSE)=\"\",\"N/A\",VLOOKUP(C84,Reference!$A$3:$B$188,2,FALSE)),\"\")","v":8.6000000000000003E-5},null,null,null,"",null,null,null,null,null,null,null,null,"",null,null,null,null,null,null,{"$f":"IF(C84<>\"\",IF(VLOOKUP(C84,Reference!$I$3:$J$188,2,FALSE)=\" \",0,VLOOKUP(C84,Reference!$I$3:$J$188,2,FALSE)),\"\")","v":50},{"$f":"IF(C84<>\"\",IF(VLOOKUP(C84,Reference!$M$3:$Q$188,5,FALSE)=\" \",0,VLOOKUP(C84,Reference!$M$3:$Q$188,5,FALSE)),\"\")","v":0}]
[null,null,"Benzo(a)Anthracene",null,null,null,null,null,null,null,null,null,"<",null,null,null,null,null,null,{"$f":"IF(C85<>\"\",IF(VLOOKUP(C85,Reference!$A$3:$B$188,2,FALSE)=\"\",\"N/A\",VLOOKUP(C85,Reference!$A$3:$B$188,2,FALSE)),\"\")","v":3.8E-3},null,null,null,"",null,null,null,null,null,null,null,null,"",null,null,null,null,null,null,{"$f":"IF(C85<>\"\",IF(VLOOKUP(C85,Reference!$I$3:$J$188,2,FALSE)=\" \",0,VLOOKUP(C85,Reference!$I$3:$J$188,2,FALSE)),\"\")","v":2.5},{"$f":"IF(C85<>\"\",IF(VLOOKUP(C85,Reference!$M$3:$Q$188,5,FALSE)=\" \",0,VLOOKUP(C85,Reference!$M$3:$Q$188,5,FALSE)),\"\")","v":0}]
[null,null,"Benzo(a)Pyrene",null,null,null,null,null,null,null,null,null,"<",null,null,null,null,null,null,{"$f":"IF(C86<>\"\",IF(VLOOKUP(C86,Reference!$A$3:$B$188,2,FALSE)=\"\",\"N/A\",VLOOKUP(C86,Reference!$A$3:$B$188,2,FALSE)),\"\")","v":3.8E-3},null,null,null,"",null,null,null,null,null,null,null,null,"",null,null,null,null,null,null,{"$f":"IF(C86<>\"\",IF(VLOOKUP(C86,Reference!$I$3:$J$188,2,FALSE)=\" \",0,VLOOKUP(C86,Reference!$I$3:$J$188,2,FALSE)),\"\")","v":2.5},{"$f":"IF(C86<>\"\",IF(VLOOKUP(C86,Reference!$M$3:$Q$188,5,FALSE)=\" \",0,VLOOKUP(C86,Reference!$M$3:$Q$188,5,FALSE)),\"\")","v":0}]
[null,null,"3,4-Benzofluoranthene",null,null,null,null,null,null,null,null,null,"<",null,null,null,null,null,null,{"$f":"IF(C87<>\"\",IF(VLOOKUP(C87,Reference!$A$3:$B$188,2,FALSE)=\"\",\"N/A\",VLOOKUP(C87,Reference!$A$3:$B$188,2,FALSE)),\"\")","v":3.8E-3},null,null,null,"",null,null,null,null,null,null,null,null,"",null,null,null,null,null,null,{"$f":"IF(C87<>\"\",IF(VLOOKUP(C87,Reference!$I$3:$J$188,2,FALSE)=\" \",0,VLOOKUP(C87,Reference!$I$3:$J$188,2,FALSE)),\"\")","v":2.5},{"$f":"IF(C87<>\"\",IF(VLOOKUP(C87,Reference!$M$3:$Q$188,5,FALSE)=\" \",0,VLOOKUP(C87,Reference!$M$3:$Q$188,5,FALSE)),\"\")","v":0}]
[null,null,"Benzo(ghi)Perylene",null,null,null,null,null,null,null,null,null,"<",null,null,null,null,null,null,{"$f":"IF(C88<>\"\",IF(VLOOKUP(C88,Reference!$A$3:$B$188,2,FALSE)=\"\",\"N/A\",VLOOKUP(C88,Reference!$A$3:$B$188,2,FALSE)),\"\")","v":"N/A"},null,null,null,"",null,null,null,null,null,null,null,null,"",null,null,null,null,null,null,{"$f":"IF(C88<>\"\",IF(VLOOKUP(C88,Reference!$I$3:$J$188,2,FALSE)=\" \",0,VLOOKUP(C88,Reference!$I$3:$J$188,2,FALSE)),\"\")","v":2.5},{"$f":"IF(C88<>\"\",IF(VLOOKUP(C88,Reference!$M$3:$Q$188,5,FALSE)=\" \",0,VLOOKUP(C88,Reference!$M$3:$Q$188,5,FALSE)),\"\")","v":0}]
[null,null,"Benzo(k)Fluoranthene",null,null,null,null,null,null,null,null,null,"<",null,null,null,null,null,null,{"$f":"IF(C89<>\"\",IF(VLOOKUP(C89,Reference!$A$3:$B$188,2,FALSE)=\"\",\"N/A\",VLOOKUP(C89,Reference!$A$3:$B$188,2,FALSE)),\"\")","v":3.8E-3},null,null,null,"",null,null,null,null,null,null,null,null,"",null,null,null,null,null,null,{"$f":"IF(C89<>\"\",IF(VLOOKUP(C89,Reference!$I$3:$J$188,2,FALSE)=\" \",0,VLOOKUP(C89,Reference!$I$3:$J$188,2,FALSE)),\"\")","v":2.5},{"$f":"IF(C89<>\"\",IF(VLOOKUP(C89,Reference!$M$3:$Q$188,5,FALSE)=\" \",0,VLOOKUP(C89,Reference!$M$3:$Q$188,5,FALSE)),\"\")","v":0}]
[null,null,"Bis(2-Chloroethoxy)Methane",null,null,null,null,null,null,null,null,null,"<",null,null,null,null,null,null,{"$f":"IF(C90<>\"\",IF(VLOOKUP(C90,Reference!$A$3:$B$188,2,FALSE)=\"\",\"N/A\",VLOOKUP(C90,Reference!$A$3:$B$188,2,FALSE)),\"\")","v":"N/A"},null,null,null,"",null,null,null,null,null,null,null,null,"",null,null,null,null,null,null,{"$f":"IF(C90<>\"\",IF(VLOOKUP(C90,Reference!$I$3:$J$188,2,FALSE)=\" \",0,VLOOKUP(C90,Reference!$I$3:$J$188,2,FALSE)),\"\")","v":5},{"$f":"IF(C90<>\"\",IF(VLOOKUP(C90,Reference!$M$3:$Q$188,5,FALSE)=\" \",0,VLOOKUP(C90,Reference!$M$3:$Q$188,5,FALSE)),\"\")","v":0}]
[null,null,"Bis(2-Chloroethyl)Ether",null,null,null,null,null,null,null,null,null,"<",null,null,null,null,null,null,{"$f":"IF(C91<>\"\",IF(VLOOKUP(C91,Reference!$A$3:$B$188,2,FALSE)=\"\",\"N/A\",VLOOKUP(C91,Reference!$A$3:$B$188,2,FALSE)),\"\")","v":3.0000000000000002E-2},null,null,null,"",null,null,null,null,null,null,null,null,"",null,null,null,null,null,null,{"$f":"IF(C91<>\"\",IF(VLOOKUP(C91,Reference!$I$3:$J$188,2,FALSE)=\" \",0,VLOOKUP(C91,Reference!$I$3:$J$188,2,FALSE)),\"\")","v":5},{"$f":"IF(C91<>\"\",IF(VLOOKUP(C91,Reference!$M$3:$Q$188,5,FALSE)=\" \",0,VLOOKUP(C91,Reference!$M$3:$Q$188,5,FALSE)),\"\")","v":0}]
[null,null,"Bis(2-Chloroisopropyl)Ether",null,null,null,null,null,null,null,null,null,"<",null,null,null,null,null,null,{"$f":"IF(C92<>\"\",IF(VLOOKUP(C92,Reference!$A$3:$B$188,2,FALSE)=\"\",\"N/A\",VLOOKUP(C92,Reference!$A$3:$B$188,2,FALSE)),\"\")","v":1400},null,null,null,"",null,null,null,null,null,null,null,null,"",null,null,null,null,null,null,{"$f":"IF(C92<>\"\",IF(VLOOKUP(C92,Reference!$I$3:$J$188,2,FALSE)=\" \",0,VLOOKUP(C92,Reference!$I$3:$J$188,2,FALSE)),\"\")","v":5},{"$f":"IF(C92<>\"\",IF(VLOOKUP(C92,Reference!$M$3:$Q$188,5,FALSE)=\" \",0,VLOOKUP(C92,Reference!$M$3:$Q$188,5,FALSE)),\"\")","v":0}]
[null,null,"Bis(2-Ethylhexyl)Phthalate",null,null,null,null,null,null,null,null,null,"<",null,null,null,null,null,null,{"$f":"IF(C93<>\"\",IF(VLOOKUP(C93,Reference!$A$3:$B$188,2,FALSE)=\"\",\"N/A\",VLOOKUP(C93,Reference!$A$3:$B$188,2,FALSE)),\"\")","v":1.2},null,null,null,"",null,null,null,null,null,null,null,null,"",null,null,null,null,null,null,{"$f":"IF(C93<>\"\",IF(VLOOKUP(C93,Reference!$I$3:$J$188,2,FALSE)=\" \",0,VLOOKUP(C93,Reference!$I$3:$J$188,2,FALSE)),\"\")","v":5},{"$f":"IF(C93<>\"\",IF(VLOOKUP(C93,Reference!$M$3:$Q$188,5,FALSE)=\" \",0,VLOOKUP(C93,Reference!$M$3:$Q$188,5,FALSE)),\"\")","v":0}]
[null,null,"4-Bromophenyl Phenyl Ether",null,null,null,null,null,null,null,null,null,"<",null,null,null,null,null,null,{"$f":"IF(C94<>\"\",IF(VLOOKUP(C94,Reference!$A$3:$B$188,2,FALSE)=\"\",\"N/A\",VLOOKUP(C94,Reference!$A$3:$B$188,2,FALSE)),\"\")","v":54},null,null,null,"",null,null,null,null,null,null,null,null,"",null,null,null,null,null,null,{"$f":"IF(C94<>\"\",IF(VLOOKUP(C94,Reference!$I$3:$J$188,2,FALSE)=\" \",0,VLOOKUP(C94,Reference!$I$3:$J$188,2,FALSE)),\"\")","v":5},{"$f":"IF(C94<>\"\",IF(VLOOKUP(C94,Reference!$M$3:$Q$188,5,FALSE)=\" \",0,VLOOKUP(C94,Reference!$M$3:$Q$188,5,FALSE)),\"\")","v":0}]
[null,null,"Butyl Benzyl Phthalate",null,null,null,null,null,null,null,null,null,"<",null,null,null,null,null,null,{"$f":"IF(C95<>\"\",IF(VLOOKUP(C95,Reference!$A$3:$B$188,2,FALSE)=\"\",\"N/A\",VLOOKUP(C95,Reference!$A$3:$B$188,2,FALSE)),\"\")","v":35},null,null,null,"",null,null,null,null,null,null,null,null,"",null,null,null,null,null,null,{"$f":"IF(C95<>\"\",IF(VLOOKUP(C95,Reference!$I$3:$J$188,2,FALSE)=\" \",0,VLOOKUP(C95,Reference!$I$3:$J$188,2,FALSE)),\"\")","v":5},{"$f":"IF(C95<>\"\",IF(VLOOKUP(C95,Reference!$M$3:$Q$188,5,FALSE)=\" \",0,VLOOKUP(C95,Reference!$M$3:$Q$188,5,FALSE)),\"\")","v":0}]
[null,null,"2-Chloronaphthalene",null,null,null,null,null,null,null,null,null,"<",null,null,null,null,null,null,{"$f":"IF(C96<>\"\",IF(VLOOKUP(C96,Reference!$A$3:$B$188,2,FALSE)=\"\",\"N/A\",VLOOKUP(C96,Reference!$A$3:$B$188,2,FALSE)),\"\")","v":1000},null,null,null,"",null,null,null,null,null,null,null,null,"",null,null,null,null,null,null,{"$f":"IF(C96<>\"\",IF(VLOOKUP(C96,Reference!$I$3:$J$188,2,FALSE)=\" \",0,VLOOKUP(C96,Reference!$I$3:$J$188,2,FALSE)),\"\")","v":5},{"$f":"IF(C96<>\"\",IF(VLOOKUP(C96,Reference!$M$3:$Q$188,5,FALSE)=\" \",0,VLOOKUP(C96,Reference!$M$3:$Q$188,5,FALSE)),\"\")","v":0}]
[null,null,"4-Chlorophenyl Phenyl Ether",null,null,null,null,null,null,null,null,null,"<",null,null,null,null,null,null,{"$f":"IF(C97<>\"\",IF(VLOOKUP(C97,Reference!$A$3:$B$188,2,FALSE)=\"\",\"N/A\",VLOOKUP(C97,Reference!$A$3:$B$188,2,FALSE)),\"\")","v":"N/A"},null,null,null,"",null,null,null,null,null,null,null,null,"",null,null,null,null,null,null,{"$f":"IF(C97<>\"\",IF(VLOOKUP(C97,Reference!$I$3:$J$188,2,FALSE)=\" \",0,VLOOKUP(C97,Reference!$I$3:$J$188,2,FALSE)),\"\")","v":5},{"$f":"IF(C97<>\"\",IF(VLOOKUP(C97,Reference!$M$3:$Q$188,5,FALSE)=\" \",0,VLOOKUP(C97,Reference!$M$3:$Q$188,5,FALSE)),\"\")","v":0}]
[null,null,"Chrysene",null,null,null,null,null,null,null,null,null,"<",null,null,null,null,null,null,{"$f":"IF(C98<>\"\",IF(VLOOKUP(C98,Reference!$A$3:$B$188,2,FALSE)=\"\",\"N/A\",VLOOKUP(C98,Reference!$A$3:$B$188,2,FALSE)),\"\")","v":3.8E-3},null,null,null,"",null,null,null,null,null,null,null,null,"",null,null,null,null,null,null,{"$f":"IF(C98<>\"\",IF(VLOOKUP(C98,Reference!$I$3:$J$188,2,FALSE)=\" \",0,VLOOKUP(C98,Reference!$I$3:$J$188,2,FALSE)),\"\")","v":2.5},{"$f":"IF(C98<>\"\",IF(VLOOKUP(C98,Reference!$M$3:$Q$188,5,FALSE)=\" \",0,VLOOKUP(C98,Reference!$M$3:$Q$188,5,FALSE)),\"\")","v":0}]
[null,null,"Dibenzo(a,h)Anthrancene",null,null,null,null,null,null,null,null,null,"<",null,null,null,null,null,null,{"$f":"IF(C99<>\"\",IF(VLOOKUP(C99,Reference!$A$3:$B$188,2,FALSE)=\"\",\"N/A\",VLOOKUP(C99,Reference!$A$3:$B$188,2,FALSE)),\"\")","v":3.8E-3},null,null,null,"",null,null,null,null,null,null,null,null,"",null,null,null,null,null,null,{"$f":"IF(C99<>\"\",IF(VLOOKUP(C99,Reference!$I$3:$J$188,2,FALSE)=\" \",0,VLOOKUP(C99,Reference!$I$3:$J$188,2,FALSE)),\"\")","v":2.5},{"$f":"IF(C99<>\"\",IF(VLOOKUP(C99,Reference!$M$3:$Q$188,5,FALSE)=\" \",0,VLOOKUP(C99,Reference!$M$3:$Q$188,5,FALSE)),\"\")","v":0}]
[null,null,"1,2-Dichlorobenzene",null,null,null,null,null,null,null,null,null,"<",null,null,null,null,null,null,{"$f":"IF(C100<>\"\",IF(VLOOKUP(C100,Reference!$A$3:$B$188,2,FALSE)=\"\",\"N/A\",VLOOKUP(C100,Reference!$A$3:$B$188,2,FALSE)),\"\")","v":160},null,null,null,"",null,null,null,null,null,null,null,null,"",null,null,null,null,null,null,{"$f":"IF(C100<>\"\",IF(VLOOKUP(C100,Reference!$I$3:$J$188,2,FALSE)=\" \",0,VLOOKUP(C100,Reference!$I$3:$J$188,2,FALSE)),\"\")","v":0.5},{"$f":"IF(C100<>\"\",IF(VLOOKUP(C100,Reference!$M$3:$Q$188,5,FALSE)=\" \",0,VLOOKUP(C100,Reference!$M$3:$Q$188,5,FALSE)),\"\")","v":0}]
[null,null,"1,3-Dichlorobenzene",null,null,null,null,null,null,null,null,null,"<",null,null,null,null,null,null,{"$f":"IF(C101<>\"\",IF(VLOOKUP(C101,Reference!$A$3:$B$188,2,FALSE)=\"\",\"N/A\",VLOOKUP(C101,Reference!$A$3:$B$188,2,FALSE)),\"\")","v":69},null,null,null,"",null,null,null,null,null,null,null,null,"",null,null,null,null,null,null,{"$f":"IF(C101<>\"\",IF(VLOOKUP(C101,Reference!$I$3:$J$188,2,FALSE)=\" \",0,VLOOKUP(C101,Reference!$I$3:$J$188,2,FALSE)),\"\")","v":0.5},{"$f":"IF(C101<>\"\",IF(VLOOKUP(C101,Reference!$M$3:$Q$188,5,FALSE)=\" \",0,VLOOKUP(C101,Reference!$M$3:$Q$188,5,FALSE)),\"\")","v":0}]
[null,null,"1,4-Dichlorobenzene",null,null,null,null,null,null,null,null,null,"<",null,null,null,null,null,null,{"$f":"IF(C102<>\"\",IF(VLOOKUP(C102,Reference!$A$3:$B$188,2,FALSE)=\"\",\"N/A\",VLOOKUP(C102,Reference!$A$3:$B$188,2,FALSE)),\"\")","v":150},null,null,null,"",null,null,null,null,null,null,null,null,"",null,null,null,null,null,null,{"$f":"IF(C102<>\"\",IF(VLOOKUP(C102,Reference!$I$3:$J$188,2,FALSE)=\" \",0,VLOOKUP(C102,Reference!$I$3:$J$188,2,FALSE)),\"\")","v":0.5},{"$f":"IF(C102<>\"\",IF(VLOOKUP(C102,Reference!$M$3:$Q$188,5,FALSE)=\" \",0,VLOOKUP(C102,Reference!$M$3:$Q$188,5,FALSE)),\"\")","v":0}]
[null,null,"3,3-Dichlorobenzidine",null,null,null,null,null,null,null,null,null,"<",null,null,null,null,null,null,{"$f":"IF(C103<>\"\",IF(VLOOKUP(C103,Reference!$A$3:$B$188,2,FALSE)=\"\",\"N/A\",VLOOKUP(C103,Reference!$A$3:$B$188,2,FALSE)),\"\")","v":2.0999999999999998E-2},null,null,null,"",null,null,null,null,null,null,null,null,"",null,null,null,null,null,null,{"$f":"IF(C103<>\"\",IF(VLOOKUP(C103,Reference!$I$3:$J$188,2,FALSE)=\" \",0,VLOOKUP(C103,Reference!$I$3:$J$188,2,FALSE)),\"\")","v":5},{"$f":"IF(C103<>\"\",IF(VLOOKUP(C103,Reference!$M$3:$Q$188,5,FALSE)=\" \",0,VLOOKUP(C103,Reference!$M$3:$Q$188,5,FALSE)),\"\")","v":0}]
[null,null,"Diethyl Phthalate",null,null,null,null,null,null,null,null,null,"<",null,null,null,null,null,null,{"$f":"IF(C104<>\"\",IF(VLOOKUP(C104,Reference!$A$3:$B$188,2,FALSE)=\"\",\"N/A\",VLOOKUP(C104,Reference!$A$3:$B$188,2,FALSE)),\"\")","v":800},null,null,null,"",null,null,null,null,null,null,null,null,"",null,null,null,null,null,null,{"$f":"IF(C104<>\"\",IF(VLOOKUP(C104,Reference!$I$3:$J$188,2,FALSE)=\" \",0,VLOOKUP(C104,Reference!$I$3:$J$188,2,FALSE)),\"\")","v":5},{"$f":"IF(C104<>\"\",IF(VLOOKUP(C104,Reference!$M$3:$Q$188,5,FALSE)=\" \",0,VLOOKUP(C104,Reference!$M$3:$Q$188,5,FALSE)),\"\")","v":0}]
[null,null,"Dimethyl Phthalate",null,null,null,null,null,null,null,null,null,"<",null,null,null,null,null,null,{"$f":"IF(C105<>\"\",IF(VLOOKUP(C105,Reference!$A$3:$B$188,2,FALSE)=\"\",\"N/A\",VLOOKUP(C105,Reference!$A$3:$B$188,2,FALSE)),\"\")","v":500},null,null,null,"",null,null,null,null,null,null,null,null,"",null,null,null,null,null,null,{"$f":"IF(C105<>\"\",IF(VLOOKUP(C105,Reference!$I$3:$J$188,2,FALSE)=\" \",0,VLOOKUP(C105,Reference!$I$3:$J$188,2,FALSE)),\"\")","v":5},{"$f":"IF(C105<>\"\",IF(VLOOKUP(C105,Reference!$M$3:$Q$188,5,FALSE)=\" \",0,VLOOKUP(C105,Reference!$M$3:$Q$188,5,FALSE)),\"\")","v":0}]
[null,null,"Di-n-Butyl Phthalate",null,null,null,null,null,null,null,null,null,"<",null,null,null,null,null,null,{"$f":"IF(C106<>\"\",IF(VLOOKUP(C106,Reference!$A$3:$B$188,2,FALSE)=\"\",\"N/A\",VLOOKUP(C106,Reference!$A$3:$B$188,2,FALSE)),\"\")","v":21},null,null,null,"",null,null,null,null,null,null,null,null,"",null,null,null,null,null,null,{"$f":"IF(C106<>\"\",IF(VLOOKUP(C106,Reference!$I$3:$J$188,2,FALSE)=\" \",0,VLOOKUP(C106,Reference!$I$3:$J$188,2,FALSE)),\"\")","v":5},{"$f":"IF(C106<>\"\",IF(VLOOKUP(C106,Reference!$M$3:$Q$188,5,FALSE)=\" \",0,VLOOKUP(C106,Reference!$M$3:$Q$188,5,FALSE)),\"\")","v":0}]
[null,null,"2,4-Dinitrotoluene",null,null,null,null,null,null,null,null,null,"<",null,null,null,null,null,null,{"$f":"IF(C107<>\"\",IF(VLOOKUP(C107,Reference!$A$3:$B$188,2,FALSE)=\"\",\"N/A\",VLOOKUP(C107,Reference!$A$3:$B$188,2,FALSE)),\"\")","v":0.05},null,null,null,"",null,null,null,null,null,null,null,null,"",null,null,null,null,null,null,{"$f":"IF(C107<>\"\",IF(VLOOKUP(C107,Reference!$I$3:$J$188,2,FALSE)=\" \",0,VLOOKUP(C107,Reference!$I$3:$J$188,2,FALSE)),\"\")","v":5},{"$f":"IF(C107<>\"\",IF(VLOOKUP(C107,Reference!$M$3:$Q$188,5,FALSE)=\" \",0,VLOOKUP(C107,Reference!$M$3:$Q$188,5,FALSE)),\"\")","v":0}]
[null,null,"2,6-Dinitrotoluene",null,null,null,null,null,null,null,null,null,"<",null,null,null,null,null,null,{"$f":"IF(C108<>\"\",IF(VLOOKUP(C108,Reference!$A$3:$B$188,2,FALSE)=\"\",\"N/A\",VLOOKUP(C108,Reference!$A$3:$B$188,2,FALSE)),\"\")","v":0.05},null,null,null,"",null,null,null,null,null,null,null,null,"",null,null,null,null,null,null,{"$f":"IF(C108<>\"\",IF(VLOOKUP(C108,Reference!$I$3:$J$188,2,FALSE)=\" \",0,VLOOKUP(C108,Reference!$I$3:$J$188,2,FALSE)),\"\")","v":5},{"$f":"IF(C108<>\"\",IF(VLOOKUP(C108,Reference!$M$3:$Q$188,5,FALSE)=\" \",0,VLOOKUP(C108,Reference!$M$3:$Q$188,5,FALSE)),\"\")","v":0}]
[null,null,"1,4-Dioxane",null,null,null,null,null,null,null,null,null,"<",null,null,null,null,null,null,{"$f":"IF(C109<>\"\",IF(VLOOKUP(C109,Reference!$A$3:$B$188,2,FALSE)=\"\",\"N/A\",VLOOKUP(C109,Reference!$A$3:$B$188,2,FALSE)),\"\")","v":"N/A"},null,null,null,"",null,null,null,null,null,null,null,null,"",null,null,null,null,null,null,{"$f":"IF(C109<>\"\",IF(VLOOKUP(C109,Reference!$I$3:$J$188,2,FALSE)=\" \",0,VLOOKUP(C109,Reference!$I$3:$J$188,2,FALSE)),\"\")","v":1},{"$f":"IF(C109<>\"\",IF(VLOOKUP(C109,Reference!$M$3:$Q$188,5,FALSE)=\" \",0,VLOOKUP(C109,Reference!$M$3:$Q$188,5,FALSE)),\"\")","v":0},null,10,100,{"$f":"IF(AND($Z$7<>\"\",N109<>\"\"),IF(OR(AND($Z$7>0.1,N109>AQ109),(AND($Z$7<=0.1,N109>AR109))),\"Monitor\",\"\"),\"\")","v":""},{"$f":"IF(OR(AP109=\"Establish Limits\",AP109=\"Monitor\"),AP109,IF(AND(AP109=\"No Limits/Monitoring\",AS109=\"Monitor\"),AS109,IF(AND(AP109=\"\",AS109=\"\"),\"\",IF(AND(AP109=\"\",AS109=\"Monitor\"),\"Monitor\",IF(AND(AP109=\"\",AS109=\"\"),\"Monitor\",\"\")))))","v":""}]
[null,null,"Di-n-Octyl Phthalate",null,null,null,null,null,null,null,null,null,"<",null,null,null,null,null,null,{"$f":"IF(C110<>\"\",IF(VLOOKUP(C110,Reference!$A$3:$B$188,2,FALSE)=\"\",\"N/A\",VLOOKUP(C110,Reference!$A$3:$B$188,2,FALSE)),\"\")","v":"N/A"},null,null,null,"",null,null,null,null,null,null,null,null,"",null,null,null,null,null,null,{"$f":"IF(C110<>\"\",IF(VLOOKUP(C110,Reference!$I$3:$J$188,2,FALSE)=\" \",0,VLOOKUP(C110,Reference!$I$3:$J$188,2,FALSE)),\"\")","v":5},{"$f":"IF(C110<>\"\",IF(VLOOKUP(C110,Reference!$M$3:$Q$188,5,FALSE)=\" \",0,VLOOKUP(C110,Reference!$M$3:$Q$188,5,FALSE)),\"\")","v":0}]
[null,null,"1,2-Diphenylhydrazine",null,null,null,null,null,null,null,null,null,"<",null,null,null,null,null,null,{"$f":"IF(C111<>\"\",IF(VLOOKUP(C111,Reference!$A$3:$B$188,2,FALSE)=\"\",\"N/A\",VLOOKUP(C111,Reference!$A$3:$B$188,2,FALSE)),\"\")","v":3.6000000000000004E-2},null,null,null,"",null,null,null,null,null,null,null,null,"",null,null,null,null,null,null,{"$f":"IF(C111<>\"\",IF(VLOOKUP(C111,Reference!$I$3:$J$188,2,FALSE)=\" \",0,VLOOKUP(C111,Reference!$I$3:$J$188,2,FALSE)),\"\")","v":10},{"$f":"IF(C111<>\"\",IF(VLOOKUP(C111,Reference!$M$3:$Q$188,5,FALSE)=\" \",0,VLOOKUP(C111,Reference!$M$3:$Q$188,5,FALSE)),\"\")","v":0}]
[null,null,"Fluoranthene",null,null,null,null,null,null,null,null,null,"<",null,null,null,null,null,null,{"$f":"IF(C112<>\"\",IF(VLOOKUP(C112,Reference!$A$3:$B$188,2,FALSE)=\"\",\"N/A\",VLOOKUP(C112,Reference!$A$3:$B$188,2,FALSE)),\"\")","v":40},null,null,null,"",null,null,null,null,null,null,null,null,"",null,null,null,null,null,null,{"$f":"IF(C112<>\"\",IF(VLOOKUP(C112,Reference!$I$3:$J$188,2,FALSE)=\" \",0,VLOOKUP(C112,Reference!$I$3:$J$188,2,FALSE)),\"\")","v":2.5},{"$f":"IF(C112<>\"\",IF(VLOOKUP(C112,Reference!$M$3:$Q$188,5,FALSE)=\" \",0,VLOOKUP(C112,Reference!$M$3:$Q$188,5,FALSE)),\"\")","v":0}]
[null,null,"Fluorene",null,null,null,null,null,null,null,null,null,"<",null,null,null,null,null,null,{"$f":"IF(C113<>\"\",IF(VLOOKUP(C113,Reference!$A$3:$B$188,2,FALSE)=\"\",\"N/A\",VLOOKUP(C113,Reference!$A$3:$B$188,2,FALSE)),\"\")","v":1100},null,null,null,"",null,null,null,null,null,null,null,null,"",null,null,null,null,null,null,{"$f":"IF(C113<>\"\",IF(VLOOKUP(C113,Reference!$I$3:$J$188,2,FALSE)=\" \",0,VLOOKUP(C113,Reference!$I$3:$J$188,2,FALSE)),\"\")","v":2.5},{"$f":"IF(C113<>\"\",IF(VLOOKUP(C113,Reference!$M$3:$Q$188,5,FALSE)=\" \",0,VLOOKUP(C113,Reference!$M$3:$Q$188,5,FALSE)),\"\")","v":0}]
[null,null,"Hexachlorobenzene",null,null,null,null,null,null,null,null,null,"<",null,null,null,null,null,null,{"$f":"IF(C114<>\"\",IF(VLOOKUP(C114,Reference!$A$3:$B$188,2,FALSE)=\"\",\"N/A\",VLOOKUP(C114,Reference!$A$3:$B$188,2,FALSE)),\"\")","v":2.8000000000000003E-4},null,null,null,"",null,null,null,null,null,null,null,null,"",null,null,null,null,null,null,{"$f":"IF(C114<>\"\",IF(VLOOKUP(C114,Reference!$I$3:$J$188,2,FALSE)=\" \",0,VLOOKUP(C114,Reference!$I$3:$J$188,2,FALSE)),\"\")","v":5},{"$f":"IF(C114<>\"\",IF(VLOOKUP(C114,Reference!$M$3:$Q$188,5,FALSE)=\" \",0,VLOOKUP(C114,Reference!$M$3:$Q$188,5,FALSE)),\"\")","v":0}]
[null,null,"Hexachlorobutadiene",null,null,null,null,null,null,null,null,null,"<",null,null,null,null,null,null,{"$f":"IF(C115<>\"\",IF(VLOOKUP(C115,Reference!$A$3:$B$188,2,FALSE)=\"\",\"N/A\",VLOOKUP(C115,Reference!$A$3:$B$188,2,FALSE)),\"\")","v":0.44},null,null,null,"",null,null,null,null,null,null,null,null,"",null,null,null,null,null,null,{"$f":"IF(C115<>\"\",IF(VLOOKUP(C115,Reference!$I$3:$J$188,2,FALSE)=\" \",0,VLOOKUP(C115,Reference!$I$3:$J$188,2,FALSE)),\"\")","v":0.5},{"$f":"IF(C115<>\"\",IF(VLOOKUP(C115,Reference!$M$3:$Q$188,5,FALSE)=\" \",0,VLOOKUP(C115,Reference!$M$3:$Q$188,5,FALSE)),\"\")","v":0}]
[null,null,"Hexachlorocyclopentadiene",null,null,null,null,null,null,null,null,null,"<",null,null,null,null,null,null,{"$f":"IF(C116<>\"\",IF(VLOOKUP(C116,Reference!$A$3:$B$188,2,FALSE)=\"\",\"N/A\",VLOOKUP(C116,Reference!$A$3:$B$188,2,FALSE)),\"\")","v":1},null,null,null,"",null,null,null,null,null,null,null,null,"",null,null,null,null,null,null,{"$f":"IF(C116<>\"\",IF(VLOOKUP(C116,Reference!$I$3:$J$188,2,FALSE)=\" \",0,VLOOKUP(C116,Reference!$I$3:$J$188,2,FALSE)),\"\")","v":5},{"$f":"IF(C116<>\"\",IF(VLOOKUP(C116,Reference!$M$3:$Q$188,5,FALSE)=\" \",0,VLOOKUP(C116,Reference!$M$3:$Q$188,5,FALSE)),\"\")","v":0}]
[null,null,"Hexachloroethane",null,null,null,null,null,null,null,null,null,"<",null,null,null,null,null,null,{"$f":"IF(C117<>\"\",IF(VLOOKUP(C117,Reference!$A$3:$B$188,2,FALSE)=\"\",\"N/A\",VLOOKUP(C117,Reference!$A$3:$B$188,2,FALSE)),\"\")","v":1.4},null,null,null,"",null,null,null,null,null,null,null,null,"",null,null,null,null,null,null,{"$f":"IF(C117<>\"\",IF(VLOOKUP(C117,Reference!$I$3:$J$188,2,FALSE)=\" \",0,VLOOKUP(C117,Reference!$I$3:$J$188,2,FALSE)),\"\")","v":5},{"$f":"IF(C117<>\"\",IF(VLOOKUP(C117,Reference!$M$3:$Q$188,5,FALSE)=\" \",0,VLOOKUP(C117,Reference!$M$3:$Q$188,5,FALSE)),\"\")","v":0}]
[null,null,"Indeno(1,2,3-cd)Pyrene",null,null,null,null,null,null,null,null,null,"<",null,null,null,null,null,null,{"$f":"IF(C118<>\"\",IF(VLOOKUP(C118,Reference!$A$3:$B$188,2,FALSE)=\"\",\"N/A\",VLOOKUP(C118,Reference!$A$3:$B$188,2,FALSE)),\"\")","v":3.8E-3},null,null,null,"",null,null,null,null,null,null,null,null,"",null,null,null,null,null,null,{"$f":"IF(C118<>\"\",IF(VLOOKUP(C118,Reference!$I$3:$J$188,2,FALSE)=\" \",0,VLOOKUP(C118,Reference!$I$3:$J$188,2,FALSE)),\"\")","v":2.5},{"$f":"IF(C118<>\"\",IF(VLOOKUP(C118,Reference!$M$3:$Q$188,5,FALSE)=\" \",0,VLOOKUP(C118,Reference!$M$3:$Q$188,5,FALSE)),\"\")","v":0}]
[null,null,"Isophorone",null,null,null,null,null,null,null,null,null,"<",null,null,null,null,null,null,{"$f":"IF(C119<>\"\",IF(VLOOKUP(C119,Reference!$A$3:$B$188,2,FALSE)=\"\",\"N/A\",VLOOKUP(C119,Reference!$A$3:$B$188,2,FALSE)),\"\")","v":35},null,null,null,"",null,null,null,null,null,null,null,null,"",null,null,null,null,null,null,{"$f":"IF(C119<>\"\",IF(VLOOKUP(C119,Reference!$I$3:$J$188,2,FALSE)=\" \",0,VLOOKUP(C119,Reference!$I$3:$J$188,2,FALSE)),\"\")","v":5},{"$f":"IF(C119<>\"\",IF(VLOOKUP(C119,Reference!$M$3:$Q$188,5,FALSE)=\" \",0,VLOOKUP(C119,Reference!$M$3:$Q$188,5,FALSE)),\"\")","v":0}]
[null,null,"Naphthalene",null,null,null,null,null,null,null,null,null,"<",null,null,null,null,null,null,{"$f":"IF(C120<>\"\",IF(VLOOKUP(C120,Reference!$A$3:$B$188,2,FALSE)=\"\",\"N/A\",VLOOKUP(C120,Reference!$A$3:$B$188,2,FALSE)),\"\")","v":43},null,null,null,"",null,null,null,null,null,null,null,null,"",null,null,null,null,null,null,{"$f":"IF(C120<>\"\",IF(VLOOKUP(C120,Reference!$I$3:$J$188,2,FALSE)=\" \",0,VLOOKUP(C120,Reference!$I$3:$J$188,2,FALSE)),\"\")","v":0.5},{"$f":"IF(C120<>\"\",IF(VLOOKUP(C120,Reference!$M$3:$Q$188,5,FALSE)=\" \",0,VLOOKUP(C120,Reference!$M$3:$Q$188,5,FALSE)),\"\")","v":0}]
[null,null,"Nitrobenzene",null,null,null,null,null,null,null,null,null,"<",null,null,null,null,null,null,{"$f":"IF(C121<>\"\",IF(VLOOKUP(C121,Reference!$A$3:$B$188,2,FALSE)=\"\",\"N/A\",VLOOKUP(C121,Reference!$A$3:$B$188,2,FALSE)),\"\")","v":17},null,null,null,"",null,null,null,null,null,null,null,null,"",null,null,null,null,null,null,{"$f":"IF(C121<>\"\",IF(VLOOKUP(C121,Reference!$I$3:$J$188,2,FALSE)=\" \",0,VLOOKUP(C121,Reference!$I$3:$J$188,2,FALSE)),\"\")","v":5},{"$f":"IF(C121<>\"\",IF(VLOOKUP(C121,Reference!$M$3:$Q$188,5,FALSE)=\" \",0,VLOOKUP(C121,Reference!$M$3:$Q$188,5,FALSE)),\"\")","v":0}]
[null,null,"n-Nitrosodimethylamine",null,null,null,null,null,null,null,null,null,"<",null,null,null,null,null,null,{"$f":"IF(C122<>\"\",IF(VLOOKUP(C122,Reference!$A$3:$B$188,2,FALSE)=\"\",\"N/A\",VLOOKUP(C122,Reference!$A$3:$B$188,2,FALSE)),\"\")","v":6.8999999999999997E-4},null,null,null,"",null,null,null,null,null,null,null,null,"",null,null,null,null,null,null,{"$f":"IF(C122<>\"\",IF(VLOOKUP(C122,Reference!$I$3:$J$188,2,FALSE)=\" \",0,VLOOKUP(C122,Reference!$I$3:$J$188,2,FALSE)),\"\")","v":5},{"$f":"IF(C122<>\"\",IF(VLOOKUP(C122,Reference!$M$3:$Q$188,5,FALSE)=\" \",0,VLOOKUP(C122,Reference!$M$3:$Q$188,5,FALSE)),\"\")","v":0}]
[null,null,"n-Nitrosodi-n-Propylamine",null,null,null,null,null,null,null,null,null,"<",null,null,null,null,null,null,{"$f":"IF(C123<>\"\",IF(VLOOKUP(C123,Reference!$A$3:$B$188,2,FALSE)=\"\",\"N/A\",VLOOKUP(C123,Reference!$A$3:$B$188,2,FALSE)),\"\")","v":5.0000000000000001E-3},null,null,null,"",null,null,null,null,null,null,null,null,"",null,null,null,null,null,null,{"$f":"IF(C123<>\"\",IF(VLOOKUP(C123,Reference!$I$3:$J$188,2,FALSE)=\" \",0,VLOOKUP(C123,Reference!$I$3:$J$188,2,FALSE)),\"\")","v":5},{"$f":"IF(C123<>\"\",IF(VLOOKUP(C123,Reference!$M$3:$Q$188,5,FALSE)=\" \",0,VLOOKUP(C123,Reference!$M$3:$Q$188,5,FALSE)),\"\")","v":0}]
[null,null,"n-Nitrosodiphenylamine",null,null,null,null,null,null,null,null,null,"<",null,null,null,null,null,null,{"$f":"IF(C124<>\"\",IF(VLOOKUP(C124,Reference!$A$3:$B$188,2,FALSE)=\"\",\"N/A\",VLOOKUP(C124,Reference!$A$3:$B$188,2,FALSE)),\"\")","v":3.3},null,null,null,"",null,null,null,null,null,null,null,null,"",null,null,null,null,null,null,{"$f":"IF(C124<>\"\",IF(VLOOKUP(C124,Reference!$I$3:$J$188,2,FALSE)=\" \",0,VLOOKUP(C124,Reference!$I$3:$J$188,2,FALSE)),\"\")","v":5},{"$f":"IF(C124<>\"\",IF(VLOOKUP(C124,Reference!$M$3:$Q$188,5,FALSE)=\" \",0,VLOOKUP(C124,Reference!$M$3:$Q$188,5,FALSE)),\"\")","v":0}]
[null,null,"Phenanthrene",null,null,null,null,null,null,null,null,null,"<",null,null,null,null,null,null,{"$f":"IF(C125<>\"\",IF(VLOOKUP(C125,Reference!$A$3:$B$188,2,FALSE)=\"\",\"N/A\",VLOOKUP(C125,Reference!$A$3:$B$188,2,FALSE)),\"\")","v":1},null,null,null,"",null,null,null,null,null,null,null,null,"",null,null,null,null,null,null,{"$f":"IF(C125<>\"\",IF(VLOOKUP(C125,Reference!$I$3:$J$188,2,FALSE)=\" \",0,VLOOKUP(C125,Reference!$I$3:$J$188,2,FALSE)),\"\")","v":2.5},{"$f":"IF(C125<>\"\",IF(VLOOKUP(C125,Reference!$M$3:$Q$188,5,FALSE)=\" \",0,VLOOKUP(C125,Reference!$M$3:$Q$188,5,FALSE)),\"\")","v":0}]
[null,null,"Pyrene",null,null,null,null,null,null,null,null,null,"<",null,null,null,null,null,null,{"$f":"IF(C126<>\"\",IF(VLOOKUP(C126,Reference!$A$3:$B$188,2,FALSE)=\"\",\"N/A\",VLOOKUP(C126,Reference!$A$3:$B$188,2,FALSE)),\"\")","v":830},null,null,null,"",null,null,null,null,null,null,null,null,"",null,null,null,null,null,null,{"$f":"IF(C126<>\"\",IF(VLOOKUP(C126,Reference!$I$3:$J$188,2,FALSE)=\" \",0,VLOOKUP(C126,Reference!$I$3:$J$188,2,FALSE)),\"\")","v":2.5},{"$f":"IF(C126<>\"\",IF(VLOOKUP(C126,Reference!$M$3:$Q$188,5,FALSE)=\" \",0,VLOOKUP(C126,Reference!$M$3:$Q$188,5,FALSE)),\"\")","v":0}]
[null,null,"1,2,4-Trichlorobenzene",null,null,null,null,null,null,null,null,null,"<",null,null,null,null,null,null,{"$f":"IF(C127<>\"\",IF(VLOOKUP(C127,Reference!$A$3:$B$188,2,FALSE)=\"\",\"N/A\",VLOOKUP(C127,Reference!$A$3:$B$188,2,FALSE)),\"\")","v":26},null,null,null,"",null,null,null,null,null,null,null,null,"",null,null,null,null,null,null,{"$f":"IF(C127<>\"\",IF(VLOOKUP(C127,Reference!$I$3:$J$188,2,FALSE)=\" \",0,VLOOKUP(C127,Reference!$I$3:$J$188,2,FALSE)),\"\")","v":0.5},{"$f":"IF(C127<>\"\",IF(VLOOKUP(C127,Reference!$M$3:$Q$188,5,FALSE)=\" \",0,VLOOKUP(C127,Reference!$M$3:$Q$188,5,FALSE)),\"\")","v":0}]
[null,"Group 6","Aldrin",null,null,null,null,null,null,null,null,null,"<",null,null,null,null,null,null,{"$f":"IF(C128<>\"\",IF(VLOOKUP(C128,Reference!$A$3:$B$188,2,FALSE)=\"\",\"N/A\",VLOOKUP(C128,Reference!$A$3:$B$188,2,FALSE)),\"\")","v":4.9000000000000005E-5},null,null,null,"",null,null,null,null,null,null,null,null,"",null,null,null,null,null,null,{"$f":"IF(C128<>\"\",IF(VLOOKUP(C128,Reference!$I$3:$J$188,2,FALSE)=\" \",0,VLOOKUP(C128,Reference!$I$3:$J$188,2,FALSE)),\"\")","v":0.05},{"$f":"IF(C128<>\"\",IF(VLOOKUP(C128,Reference!$M$3:$Q$188,5,FALSE)=\" \",0,VLOOKUP(C128,Reference!$M$3:$Q$188,5,FALSE)),\"\")","v":0}]
[null,null,"alpha-BHC",null,null,null,null,null,null,null,null,null,"<",null,null,null,null,null,null,{"$f":"IF(C129<>\"\",IF(VLOOKUP(C129,Reference!$A$3:$B$188,2,FALSE)=\"\",\"N/A\",VLOOKUP(C129,Reference!$A$3:$B$188,2,FALSE)),\"\")","v":2.5999999999999999E-3},null,null,null,"",null,null,null,null,null,null,null,null,"",null,null,null,null,null,null,{"$f":"IF(C129<>\"\",IF(VLOOKUP(C129,Reference!$I$3:$J$188,2,FALSE)=\" \",0,VLOOKUP(C129,Reference!$I$3:$J$188,2,FALSE)),\"\")","v":0.05},{"$f":"IF(C129<>\"\",IF(VLOOKUP(C129,Reference!$M$3:$Q$188,5,FALSE)=\" \",0,VLOOKUP(C129,Reference!$M$3:$Q$188,5,FALSE)),\"\")","v":0}]
[null,null,"beta-BHC",null,null,null,null,null,null,null,null,null,"<",null,null,null,null,null,null,{"$f":"IF(C130<>\"\",IF(VLOOKUP(C130,Reference!$A$3:$B$188,2,FALSE)=\"\",\"N/A\",VLOOKUP(C130,Reference!$A$3:$B$188,2,FALSE)),\"\")","v":9.0999999999999987E-3},null,null,null,"",null,null,null,null,null,null,null,null,"",null,null,null,null,null,null,{"$f":"IF(C130<>\"\",IF(VLOOKUP(C130,Reference!$I$3:$J$188,2,FALSE)=\" \",0,VLOOKUP(C130,Reference!$I$3:$J$188,2,FALSE)),\"\")","v":0.05},{"$f":"IF(C130<>\"\",IF(VLOOKUP(C130,Reference!$M$3:$Q$188,5,FALSE)=\" \",0,VLOOKUP(C130,Reference!$M$3:$Q$188,5,FALSE)),\"\")","v":0}]
[null,null,"gamma-BHC",null,null,null,null,null,null,null,null,null,"<",null,null,null,null,null,null,{"$f":"IF(C131<>\"\",IF(VLOOKUP(C131,Reference!$A$3:$B$188,2,FALSE)=\"\",\"N/A\",VLOOKUP(C131,Reference!$A$3:$B$188,2,FALSE)),\"\")","v":9.8000000000000004E-2},null,null,null,"",null,null,null,null,null,null,null,null,"",null,null,null,null,null,null,{"$f":"IF(C131<>\"\",IF(VLOOKUP(C131,Reference!$I$3:$J$188,2,FALSE)=\" \",0,VLOOKUP(C131,Reference!$I$3:$J$188,2,FALSE)),\"\")","v":0.05},{"$f":"IF(C131<>\"\",IF(VLOOKUP(C131,Reference!$M$3:$Q$188,5,FALSE)=\" \",0,VLOOKUP(C131,Reference!$M$3:$Q$188,5,FALSE)),\"\")","v":0}]
[null,null,"delta BHC",null,null,null,null,null,null,null,null,null,"<",null,null,null,null,null,null,{"$f":"IF(C132<>\"\",IF(VLOOKUP(C132,Reference!$A$3:$B$188,2,FALSE)=\"\",\"N/A\",VLOOKUP(C132,Reference!$A$3:$B$188,2,FALSE)),\"\")","v":"N/A"},null,null,null,"",null,null,null,null,null,null,null,null,"",null,null,null,null,null,null,{"$f":"IF(C132<>\"\",IF(VLOOKUP(C132,Reference!$I$3:$J$188,2,FALSE)=\" \",0,VLOOKUP(C132,Reference!$I$3:$J$188,2,FALSE)),\"\")","v":0.05},{"$f":"IF(C132<>\"\",IF(VLOOKUP(C132,Reference!$M$3:$Q$188,5,FALSE)=\" \",0,VLOOKUP(C132,Reference!$M$3:$Q$188,5,FALSE)),\"\")","v":0}]
[null,null,"Chlordane",null,null,null,null,null,null,null,null,null,"<",null,null,null,null,null,null,{"$f":"IF(C133<>\"\",IF(VLOOKUP(C133,Reference!$A$3:$B$188,2,FALSE)=\"\",\"N/A\",VLOOKUP(C133,Reference!$A$3:$B$188,2,FALSE)),\"\")","v":7.9999999999999993E-4},null,null,null,"",null,null,null,null,null,null,null,null,"",null,null,null,null,null,null,{"$f":"IF(C133<>\"\",IF(VLOOKUP(C133,Reference!$I$3:$J$188,2,FALSE)=\" \",0,VLOOKUP(C133,Reference!$I$3:$J$188,2,FALSE)),\"\")","v":1},{"$f":"IF(C133<>\"\",IF(VLOOKUP(C133,Reference!$M$3:$Q$188,5,FALSE)=\" \",0,VLOOKUP(C133,Reference!$M$3:$Q$188,5,FALSE)),\"\")","v":0}]
[null,null,"4,4-DDT",null,null,null,null,null,null,null,null,null,"<",null,null,null,null,null,null,{"$f":"IF(C134<>\"\",IF(VLOOKUP(C134,Reference!$A$3:$B$188,2,FALSE)=\"\",\"N/A\",VLOOKUP(C134,Reference!$A$3:$B$188,2,FALSE)),\"\")","v":2.2000000000000001E-4},null,null,null,"",null,null,null,null,null,null,null,null,"",null,null,null,null,null,null,{"$f":"IF(C134<>\"\",IF(VLOOKUP(C134,Reference!$I$3:$J$188,2,FALSE)=\" \",0,VLOOKUP(C134,Reference!$I$3:$J$188,2,FALSE)),\"\")","v":0.05},{"$f":"IF(C134<>\"\",IF(VLOOKUP(C134,Reference!$M$3:$Q$188,5,FALSE)=\" \",0,VLOOKUP(C134,Reference!$M$3:$Q$188,5,FALSE)),\"\")","v":0}]
[null,null,"4,4-DDE",null,null,null,null,null,null,null,null,null,"<",null,null,null,null,null,null,{"$f":"IF(C135<>\"\",IF(VLOOKUP(C135,Reference!$A$3:$B$188,2,FALSE)=\"\",\"N/A\",VLOOKUP(C135,Reference!$A$3:$B$188,2,FALSE)),\"\")","v":2.2000000000000001E-4},null,null,null,"",null,null,null,null,null,null,null,null,"",null,null,null,null,null,null,{"$f":"IF(C135<>\"\",IF(VLOOKUP(C135,Reference!$I$3:$J$188,2,FALSE)=\" \",0,VLOOKUP(C135,Reference!$I$3:$J$188,2,FALSE)),\"\")","v":0.05},{"$f":"IF(C135<>\"\",IF(VLOOKUP(C135,Reference!$M$3:$Q$188,5,FALSE)=\" \",0,VLOOKUP(C135,Reference!$M$3:$Q$188,5,FALSE)),\"\")","v":0}]
[null,null,"4,4-DDD",null,null,null,null,null,null,null,null,null,"<",null,null,null,null,null,null,{"$f":"IF(C136<>\"\",IF(VLOOKUP(C136,Reference!$A$3:$B$188,2,FALSE)=\"\",\"N/A\",VLOOKUP(C136,Reference!$A$3:$B$188,2,FALSE)),\"\")","v":3.1E-4},null,null,null,"",null,null,null,null,null,null,null,null,"",null,null,null,null,null,null,{"$f":"IF(C136<>\"\",IF(VLOOKUP(C136,Reference!$I$3:$J$188,2,FALSE)=\" \",0,VLOOKUP(C136,Reference!$I$3:$J$188,2,FALSE)),\"\")","v":0.05},{"$f":"IF(C136<>\"\",IF(VLOOKUP(C136,Reference!$M$3:$Q$188,5,FALSE)=\" \",0,VLOOKUP(C136,Reference!$M$3:$Q$188,5,FALSE)),\"\")","v":0}]
[null,null,"Dieldrin",null,null,null,null,null,null,null,null,null,"<",null,null,null,null,null,null,{"$f":"IF(C137<>\"\",IF(VLOOKUP(C137,Reference!$A$3:$B$188,2,FALSE)=\"\",\"N/A\",VLOOKUP(C137,Reference!$A$3:$B$188,2,FALSE)),\"\")","v":5.2000000000000004E-5},null,null,null,"",null,null,null,null,null,null,null,null,"",null,null,null,null,null,null,{"$f":"IF(C137<>\"\",IF(VLOOKUP(C137,Reference!$I$3:$J$188,2,FALSE)=\" \",0,VLOOKUP(C137,Reference!$I$3:$J$188,2,FALSE)),\"\")","v":0.05},{"$f":"IF(C137<>\"\",IF(VLOOKUP(C137,Reference!$M$3:$Q$188,5,FALSE)=\" \",0,VLOOKUP(C137,Reference!$M$3:$Q$188,5,FALSE)),\"\")","v":0}]
[null,null,"alpha-Endosulfan",null,null,null,null,null,null,null,null,null,"<",null,null,null,null,null,null,{"$f":"IF(C138<>\"\",IF(VLOOKUP(C138,Reference!$A$3:$B$188,2,FALSE)=\"\",\"N/A\",VLOOKUP(C138,Reference!$A$3:$B$188,2,FALSE)),\"\")","v":5.6000000000000001E-2},null,null,null,"",null,null,null,null,null,null,null,null,"",null,null,null,null,null,null,{"$f":"IF(C138<>\"\",IF(VLOOKUP(C138,Reference!$I$3:$J$188,2,FALSE)=\" \",0,VLOOKUP(C138,Reference!$I$3:$J$188,2,FALSE)),\"\")","v":0.05},{"$f":"IF(C138<>\"\",IF(VLOOKUP(C138,Reference!$M$3:$Q$188,5,FALSE)=\" \",0,VLOOKUP(C138,Reference!$M$3:$Q$188,5,FALSE)),\"\")","v":0}]
[null,null,"beta-Endosulfan",null,null,null,null,null,null,null,null,null,"<",null,null,null,null,null,null,{"$f":"IF(C139<>\"\",IF(VLOOKUP(C139,Reference!$A$3:$B$188,2,FALSE)=\"\",\"N/A\",VLOOKUP(C139,Reference!$A$3:$B$188,2,FALSE)),\"\")","v":5.6000000000000001E-2},null,null,null,"",null,null,null,null,null,null,null,null,"",null,null,null,null,null,null,{"$f":"IF(C139<>\"\",IF(VLOOKUP(C139,Reference!$I$3:$J$188,2,FALSE)=\" \",0,VLOOKUP(C139,Reference!$I$3:$J$188,2,FALSE)),\"\")","v":0.05},{"$f":"IF(C139<>\"\",IF(VLOOKUP(C139,Reference!$M$3:$Q$188,5,FALSE)=\" \",0,VLOOKUP(C139,Reference!$M$3:$Q$188,5,FALSE)),\"\")","v":0}]
[null,null,"Endosulfan Sulfate",null,null,null,null,null,null,null,null,null,"<",null,null,null,null,null,null,{"$f":"IF(C140<>\"\",IF(VLOOKUP(C140,Reference!$A$3:$B$188,2,FALSE)=\"\",\"N/A\",VLOOKUP(C140,Reference!$A$3:$B$188,2,FALSE)),\"\")","v":"N/A"},null,null,null,"",null,null,null,null,null,null,null,null,"",null,null,null,null,null,null,{"$f":"IF(C140<>\"\",IF(VLOOKUP(C140,Reference!$I$3:$J$188,2,FALSE)=\" \",0,VLOOKUP(C140,Reference!$I$3:$J$188,2,FALSE)),\"\")","v":0.05},{"$f":"IF(C140<>\"\",IF(VLOOKUP(C140,Reference!$M$3:$Q$188,5,FALSE)=\" \",0,VLOOKUP(C140,Reference!$M$3:$Q$188,5,FALSE)),\"\")","v":0}]
[null,null,"Endrin",null,null,null,null,null,null,null,null,null,"<",null,null,null,null,null,null,{"$f":"IF(C141<>\"\",IF(VLOOKUP(C141,Reference!$A$3:$B$188,2,FALSE)=\"\",\"N/A\",VLOOKUP(C141,Reference!$A$3:$B$188,2,FALSE)),\"\")","v":3.6000000000000004E-2},null,null,null,"",null,null,null,null,null,null,null,null,"",null,null,null,null,null,null,{"$f":"IF(C141<>\"\",IF(VLOOKUP(C141,Reference!$I$3:$J$188,2,FALSE)=\" \",0,VLOOKUP(C141,Reference!$I$3:$J$188,2,FALSE)),\"\")","v":0.05},{"$f":"IF(C141<>\"\",IF(VLOOKUP(C141,Reference!$M$3:$Q$188,5,FALSE)=\" \",0,VLOOKUP(C141,Reference!$M$3:$Q$188,5,FALSE)),\"\")","v":0}]
[null,null,"Endrin Aldehyde",null,null,null,null,null,null,null,null,null,"<",null,null,null,null,null,null,{"$f":"IF(C142<>\"\",IF(VLOOKUP(C142,Reference!$A$3:$B$188,2,FALSE)=\"\",\"N/A\",VLOOKUP(C142,Reference!$A$3:$B$188,2,FALSE)),\"\")","v":0.28999999999999998},null,null,null,"",null,null,null,null,null,null,null,null,"",null,null,null,null,null,null,{"$f":"IF(C142<>\"\",IF(VLOOKUP(C142,Reference!$I$3:$J$188,2,FALSE)=\" \",0,VLOOKUP(C142,Reference!$I$3:$J$188,2,FALSE)),\"\")","v":0.05},{"$f":"IF(C142<>\"\",IF(VLOOKUP(C142,Reference!$M$3:$Q$188,5,FALSE)=\" \",0,VLOOKUP(C142,Reference!$M$3:$Q$188,5,FALSE)),\"\")","v":0}]
[null,null,"Heptachlor",null,null,null,null,null,null,null,null,null,"<",null,null,null,null,null,null,{"$f":"IF(C143<>\"\",IF(VLOOKUP(C143,Reference!$A$3:$B$188,2,FALSE)=\"\",\"N/A\",VLOOKUP(C143,Reference!$A$3:$B$188,2,FALSE)),\"\")","v":7.9000000000000009E-5},null,null,null,"",null,null,null,null,null,null,null,null,"",null,null,null,null,null,null,{"$f":"IF(C143<>\"\",IF(VLOOKUP(C143,Reference!$I$3:$J$188,2,FALSE)=\" \",0,VLOOKUP(C143,Reference!$I$3:$J$188,2,FALSE)),\"\")","v":0.05},{"$f":"IF(C143<>\"\",IF(VLOOKUP(C143,Reference!$M$3:$Q$188,5,FALSE)=\" \",0,VLOOKUP(C143,Reference!$M$3:$Q$188,5,FALSE)),\"\")","v":0}]
[null,null,"Heptachlor Epoxide",null,null,null,null,null,null,null,null,null,"<",null,null,null,null,null,null,{"$f":"IF(C144<>\"\",IF(VLOOKUP(C144,Reference!$A$3:$B$188,2,FALSE)=\"\",\"N/A\",VLOOKUP(C144,Reference!$A$3:$B$188,2,FALSE)),\"\")","v":3.8999999999999999E-5},null,null,null,"",null,null,null,null,null,null,null,null,"",null,null,null,null,null,null,{"$f":"IF(C144<>\"\",IF(VLOOKUP(C144,Reference!$I$3:$J$188,2,FALSE)=\" \",0,VLOOKUP(C144,Reference!$I$3:$J$188,2,FALSE)),\"\")","v":0.05},{"$f":"IF(C144<>\"\",IF(VLOOKUP(C144,Reference!$M$3:$Q$188,5,FALSE)=\" \",0,VLOOKUP(C144,Reference!$M$3:$Q$188,5,FALSE)),\"\")","v":0}]
[null,null,"PCB-1242",null,null,null,null,null,null,null,null,null,"<",null,null,null,null,null,null,{"$f":"IF(C145<>\"\",IF(VLOOKUP(C145,Reference!$A$3:$B$188,2,FALSE)=\"\",\"N/A\",VLOOKUP(C145,Reference!$A$3:$B$188,2,FALSE)),\"\")","v":"N/A"},null,null,null,"",null,null,null,null,null,null,null,null,"",null,null,null,null,null,null,null,{"$f":"IF(C145<>\"\",IF(VLOOKUP(C145,Reference!$M$3:$Q$188,5,FALSE)=\" \",0,VLOOKUP(C145,Reference!$M$3:$Q$188,5,FALSE)),\"\")","v":0}]
[null,null,"PCB-1254",null,null,null,null,null,null,null,null,null,"<",null,null,null,null,null,null,{"$f":"IF(C146<>\"\",IF(VLOOKUP(C146,Reference!$A$3:$B$188,2,FALSE)=\"\",\"N/A\",VLOOKUP(C146,Reference!$A$3:$B$188,2,FALSE)),\"\")","v":"N/A"},null,null,null,{"$f":"IF(AND(C146<>\"\",N146<>\"\",$J$8<>\"\",$Z$7<>\"\"),IF(T146<>\"N/A\",IF(AND(N146<=VALUE(AN146),M146=\"<\"),\"No (Value < QL)\",IF($AP$9=\"No\",IF(N146>=(0.5*T146),IF(AND(M146=\"<\",N146=(0.5*T146)),\"No\",\"Yes\"),\"No\"),IF(N146>=T146,IF(AND(M146=\"<\",N146=T146),\"No\",\"Yes\"),\"No\"))),\"No\"),\"\")","v":""},null,null,null,null,null,null,null,null,{"$f":"IF($N146<>\"\",IF(AND(X146=\"Yes\",AC146<>\"\"),IF(($N146/$AC146)>=0.5,\"Establish Limits\",IF(AND($AO146=\"Y\",($N146/$AC146)>0.1),\"Monitor\",IF(AND($AO146<>\"Y\",($N146/$AC146)>0.25),\"Monitor\",\"No Limits/Monitoring\"))),\"\"),\"\")","v":""},null,null,null,null,null,null,null,{"$f":"IF(C146<>\"\",IF(VLOOKUP(C146,Reference!$M$3:$Q$188,5,FALSE)=\" \",0,VLOOKUP(C146,Reference!$M$3:$Q$188,5,FALSE)),\"\")","v":0}]
[null,null,"PCB-1221",null,null,null,null,null,null,null,null,null,"<",null,null,null,null,null,null,{"$f":"IF(C147<>\"\",IF(VLOOKUP(C147,Reference!$A$3:$B$188,2,FALSE)=\"\",\"N/A\",VLOOKUP(C147,Reference!$A$3:$B$188,2,FALSE)),\"\")","v":"N/A"},null,null,null,"",null,null,null,null,null,null,null,null,"",null,null,null,null,null,null,null,{"$f":"IF(C147<>\"\",IF(VLOOKUP(C147,Reference!$M$3:$Q$188,5,FALSE)=\" \",0,VLOOKUP(C147,Reference!$M$3:$Q$188,5,FALSE)),\"\")","v":0}]
[null,null,"PCB-1232",null,null,null,null,null,null,null,null,null,"<",null,null,null,null,null,null,{"$f":"IF(C148<>\"\",IF(VLOOKUP(C148,Reference!$A$3:$B$188,2,FALSE)=\"\",\"N/A\",VLOOKUP(C148,Reference!$A$3:$B$188,2,FALSE)),\"\")","v":"N/A"},null,null,null,"",null,null,null,null,null,null,null,null,"",null,null,null,null,null,null,null,{"$f":"IF(C148<>\"\",IF(VLOOKUP(C148,Reference!$M$3:$Q$188,5,FALSE)=\" \",0,VLOOKUP(C148,Reference!$M$3:$Q$188,5,FALSE)),\"\")","v":0}]
[null,null,"PCB-1248",null,null,null,null,null,null,null,null,null,"<",null,null,null,null,null,null,{"$f":"IF(C149<>\"\",IF(VLOOKUP(C149,Reference!$A$3:$B$188,2,FALSE)=\"\",\"N/A\",VLOOKUP(C149,Reference!$A$3:$B$188,2,FALSE)),\"\")","v":"N/A"},null,null,null,"",null,null,null,null,null,null,null,null,"",null,null,null,null,null,null,null,{"$f":"IF(C149<>\"\",IF(VLOOKUP(C149,Reference!$M$3:$Q$188,5,FALSE)=\" \",0,VLOOKUP(C149,Reference!$M$3:$Q$188,5,FALSE)),\"\")","v":0}]
[null,null,"PCB-1260",null,null,null,null,null,null,null,null,null,"<",null,null,null,null,null,null,{"$f":"IF(C150<>\"\",IF(VLOOKUP(C150,Reference!$A$3:$B$188,2,FALSE)=\"\",\"N/A\",VLOOKUP(C150,Reference!$A$3:$B$188,2,FALSE)),\"\")","v":"N/A"},null,null,null,"",null,null,null,null,null,null,null,null,"",null,null,null,null,null,null,null,{"$f":"IF(C150<>\"\",IF(VLOOKUP(C150,Reference!$M$3:$Q$188,5,FALSE)=\" \",0,VLOOKUP(C150,Reference!$M$3:$Q$188,5,FALSE)),\"\")","v":0}]
[null,null,"PCB-1016",null,null,null,null,null,null,null,null,null,"<",null,null,null,null,null,null,{"$f":"IF(C151<>\"\",IF(VLOOKUP(C151,Reference!$A$3:$B$188,2,FALSE)=\"\",\"N/A\",VLOOKUP(C151,Reference!$A$3:$B$188,2,FALSE)),\"\")","v":"N/A"},null,null,null,"",null,null,null,null,null,null,null,null,"",null,null,null,null,null,null,null,{"$f":"IF(C151<>\"\",IF(VLOOKUP(C151,Reference!$M$3:$Q$188,5,FALSE)=\" \",0,VLOOKUP(C151,Reference!$M$3:$Q$188,5,FALSE)),\"\")","v":0}]
[null,null,"Toxaphene",null,null,null,null,null,null,null,null,null,"<",null,null,null,null,null,null,{"$f":"IF(C152<>\"\",IF(VLOOKUP(C152,Reference!$A$3:$B$188,2,FALSE)=\"\",\"N/A\",VLOOKUP(C152,Reference!$A$3:$B$188,2,FALSE)),\"\")","v":1.9999999999999998E-4},null,null,null,"",null,null,null,null,null,null,null,null,"",null,null,null,null,null,null,{"$f":"IF(C152<>\"\",IF(VLOOKUP(C152,Reference!$I$3:$J$188,2,FALSE)=\" \",0,VLOOKUP(C152,Reference!$I$3:$J$188,2,FALSE)),\"\")","v":0.5},{"$f":"IF(C152<>\"\",IF(VLOOKUP(C152,Reference!$M$3:$Q$188,5,FALSE)=\" \",0,VLOOKUP(C152,Reference!$M$3:$Q$188,5,FALSE)),\"\")","v":0}]
[null,null,"2,3,7,8-TCDD",null,null,null,null,null,null,null,null,null,"<",null,null,null,null,null,null,{"$f":"IF(C153<>\"\",IF(VLOOKUP(C153,Reference!$A$3:$B$188,2,FALSE)=\"\",\"N/A\",VLOOKUP(C153,Reference!$A$3:$B$188,2,FALSE)),\"\")","v":5.0000000000000001E-9},null,null,null,"",null,null,null,null,null,null,null,null,"",null,null,null,null,null,null,{"$f":"IF(C153<>\"\",IF(VLOOKUP(C153,Reference!$I$3:$J$188,2,FALSE)=\" \",0,VLOOKUP(C153,Reference!$I$3:$J$188,2,FALSE)),\"\")","v":5.0000000000000004E-6},{"$f":"IF(C153<>\"\",IF(VLOOKUP(C153,Reference!$M$3:$Q$188,5,FALSE)=\" \",0,VLOOKUP(C153,Reference!$M$3:$Q$188,5,FALSE)),\"\")","v":0}]
[null,"Group 7","Gross Alpha (pCi/L)",null,null,null,null,null,null,null,null,null,"<",null,null,null,null,null,null,{"$f":"IF(C154<>\"\",IF(VLOOKUP(C154,Reference!$A$3:$B$188,2,FALSE)=\"\",\"N/A\",VLOOKUP(C154,Reference!$A$3:$B$188,2,FALSE)),\"\")","v":"N/A"},null,null,null,"",null,null,null,null,null,null,null,null,"",null,null,null,null,null,null,{"$f":"IF(C154<>\"\",IF(VLOOKUP(C154,Reference!$I$3:$J$188,2,FALSE)=\" \",0,VLOOKUP(C154,Reference!$I$3:$J$188,2,FALSE)),\"\")","v":3},{"$f":"IF(C154<>\"\",IF(VLOOKUP(C154,Reference!$M$3:$Q$188,5,FALSE)=\" \",0,VLOOKUP(C154,Reference!$M$3:$Q$188,5,FALSE)),\"\")","v":0}]
[null,null,"Total Beta (pCi/L)",null,null,null,null,null,null,null,null,null,"<",null,null,null,null,null,null,{"$f":"IF(C155<>\"\",IF(VLOOKUP(C155,Reference!$A$3:$B$188,2,FALSE)=\"\",\"N/A\",VLOOKUP(C155,Reference!$A$3:$B$188,2,FALSE)),\"\")","v":"N/A"},null,null,null,"",null,null,null,null,null,null,null,null,"",null,null,null,null,null,null,{"$f":"IF(C155<>\"\",IF(VLOOKUP(C155,Reference!$I$3:$J$188,2,FALSE)=\" \",0,VLOOKUP(C155,Reference!$I$3:$J$188,2,FALSE)),\"\")","v":4},{"$f":"IF(C155<>\"\",IF(VLOOKUP(C155,Reference!$M$3:$Q$188,5,FALSE)=\" \",0,VLOOKUP(C155,Reference!$M$3:$Q$188,5,FALSE)),\"\")","v":0}]
[null,null,"Radium 226/228 (pCi/L)",null,null,null,null,null,null,null,null,null,"<",null,null,null,null,null,null,{"$f":"IF(C156<>\"\",IF(VLOOKUP(C156,Reference!$A$3:$B$188,2,FALSE)=\"\",\"N/A\",VLOOKUP(C156,Reference!$A$3:$B$188,2,FALSE)),\"\")","v":"N/A"},null,null,null,"",null,null,null,null,null,null,null,null,"",null,null,null,null,null,null,{"$f":"IF(C156<>\"\",IF(VLOOKUP(C156,Reference!$I$3:$J$188,2,FALSE)=\" \",0,VLOOKUP(C156,Reference!$I$3:$J$188,2,FALSE)),\"\")","v":1},{"$f":"IF(C156<>\"\",IF(VLOOKUP(C156,Reference!$M$3:$Q$188,5,FALSE)=\" \",0,VLOOKUP(C156,Reference!$M$3:$Q$188,5,FALSE)),\"\")","v":0}]
[null,null,"Total Strontium",null,null,null,null,null,null,null,null,null,"<",null,null,null,null,null,null,{"$f":"IF(C157<>\"\",IF(VLOOKUP(C157,Reference!$A$3:$B$188,2,FALSE)=\"\",\"N/A\",VLOOKUP(C157,Reference!$A$3:$B$188,2,FALSE)),\"\")","v":4000},null,null,null,"",null,null,null,null,null,null,null,null,"",null,null,null,null,null,null,{"$f":"IF(C157<>\"\",IF(VLOOKUP(C157,Reference!$I$3:$J$188,2,FALSE)=\" \",0,VLOOKUP(C157,Reference!$I$3:$J$188,2,FALSE)),\"\")","v":10},{"$f":"IF(C157<>\"\",IF(VLOOKUP(C157,Reference!$M$3:$Q$188,5,FALSE)=\" \",0,VLOOKUP(C157,Reference!$M$3:$Q$188,5,FALSE)),\"\")","v":"Y"}]
[null,null,"Total Uranium",null,null,null,null,null,null,null,null,null,"<",null,null,null,null,null,null,{"$f":"IF(C158<>\"\",IF(VLOOKUP(C158,Reference!$A$3:$B$188,2,FALSE)=\"\",\"N/A\",VLOOKUP(C158,Reference!$A$3:$B$188,2,FALSE)),\"\")","v":"N/A"},null,null,null,"",null,null,null,null,null,null,null,null,"",null,null,null,null,null,null,{"$f":"IF(C158<>\"\",IF(VLOOKUP(C158,Reference!$I$3:$J$188,2,FALSE)=\" \",0,VLOOKUP(C158,Reference!$I$3:$J$188,2,FALSE)),\"\")","v":2},{"$f":"IF(C158<>\"\",IF(VLOOKUP(C158,Reference!$M$3:$Q$188,5,FALSE)=\" \",0,VLOOKUP(C158,Reference!$M$3:$Q$188,5,FALSE)),\"\")","v":"Y"}]
[null,null,null,null,null,null,null,null,null,null,null,null,null,null,null,null,null,null,null,{"$f":"IF(C159<>\"\",IF(VLOOKUP(C159,Reference!$A$3:$B$188,2,FALSE)=\"\",\"N/A\",VLOOKUP(C159,Reference!$A$3:$B$188,2,FALSE)),\"\")","v":""},null,null,null,"",null,null,null,null,null,null,null,null,"",null,null,null,null,null,null,{"$f":"IF(C159<>\"\",IF(VLOOKUP(C159,Reference!$I$3:$J$188,2,FALSE)=\" \",0,VLOOKUP(C159,Reference!$I$3:$J$188,2,FALSE)),\"\")","v":""},{"$f":"IF(C159<>\"\",IF(VLOOKUP(C159,Reference!$M$3:$Q$188,5,FALSE)=\" \",0,VLOOKUP(C159,Reference!$M$3:$Q$188,5,FALSE)),\"\")","v":""}]
[null,null,null,null,null,null,null,null,null,null,null,null,null,null,null,null,null,null,null,{"$f":"IF(C160<>\"\",IF(VLOOKUP(C160,Reference!$A$3:$B$188,2,FALSE)=\"\",\"N/A\",VLOOKUP(C160,Reference!$A$3:$B$188,2,FALSE)),\"\")","v":""},null,null,null,"",null,null,null,null,null,null,null,null,"",null,null,null,null,null,null,{"$f":"IF(C160<>\"\",IF(VLOOKUP(C160,Reference!$I$3:$J$188,2,FALSE)=\" \",0,VLOOKUP(C160,Reference!$I$3:$J$188,2,FALSE)),\"\")","v":""},{"$f":"IF(C160<>\"\",IF(VLOOKUP(C160,Reference!$M$3:$Q$188,5,FALSE)=\" \",0,VLOOKUP(C160,Reference!$M$3:$Q$188,5,FALSE)),\"\")","v":""}]
[null,null,null,null,null,null,null,null,null,null,null,null,null,null,null,null,null,null,null,{"$f":"IF(C161<>\"\",IF(VLOOKUP(C161,Reference!$A$3:$B$188,2,FALSE)=\"\",\"N/A\",VLOOKUP(C161,Reference!$A$3:$B$188,2,FALSE)),\"\")","v":""},null,null,null,"",null,null,null,null,null,null,null,null,"",null,null,null,null,null,null,{"$f":"IF(C161<>\"\",IF(VLOOKUP(C161,Reference!$I$3:$J$188,2,FALSE)=\" \",0,VLOOKUP(C161,Reference!$I$3:$J$188,2,FALSE)),\"\")","v":""},{"$f":"IF(C161<>\"\",IF(VLOOKUP(C161,Reference!$M$3:$Q$188,5,FALSE)=\" \",0,VLOOKUP(C161,Reference!$M$3:$Q$188,5,FALSE)),\"\")","v":""}]
[null,null,null,null,null,null,null,null,null,null,null,null,null,null,null,null,null,null,null,{"$f":"IF(C162<>\"\",IF(VLOOKUP(C162,Reference!$A$3:$B$188,2,FALSE)=\"\",\"N/A\",VLOOKUP(C162,Reference!$A$3:$B$188,2,FALSE)),\"\")","v":""},null,null,null,"",null,null,null,null,null,null,null,null,"",null,null,null,null,null,null,{"$f":"IF(C162<>\"\",IF(VLOOKUP(C162,Reference!$I$3:$J$188,2,FALSE)=\" \",0,VLOOKUP(C162,Reference!$I$3:$J$188,2,FALSE)),\"\")","v":""},{"$f":"IF(C162<>\"\",IF(VLOOKUP(C162,Reference!$M$3:$Q$188,5,FALSE)=\" \",0,VLOOKUP(C162,Reference!$M$3:$Q$188,5,FALSE)),\"\")","v":""}]
[null,null,null,null,null,null,null,null,null,null,null,null,null,null,null,null,null,null,null,{"$f":"IF(C163<>\"\",IF(VLOOKUP(C163,Reference!$A$3:$B$188,2,FALSE)=\"\",\"N/A\",VLOOKUP(C163,Reference!$A$3:$B$188,2,FALSE)),\"\")","v":""},null,null,null,"",null,null,null,null,null,null,null,null,"",null,null,null,null,null,null,{"$f":"IF(C163<>\"\",IF(VLOOKUP(C163,Reference!$I$3:$J$188,2,FALSE)=\" \",0,VLOOKUP(C163,Reference!$I$3:$J$188,2,FALSE)),\"\")","v":""},{"$f":"IF(C163<>\"\",IF(VLOOKUP(C163,Reference!$M$3:$Q$188,5,FALSE)=\" \",0,VLOOKUP(C163,Reference!$M$3:$Q$188,5,FALSE)),\"\")","v":""}]
[null,null,null,null,null,null,null,null,null,null,null,null,null,null,null,null,null,null,null,{"$f":"IF(C164<>\"\",IF(VLOOKUP(C164,Reference!$A$3:$B$188,2,FALSE)=\"\",\"N/A\",VLOOKUP(C164,Reference!$A$3:$B$188,2,FALSE)),\"\")","v":""},null,null,null,"",null,null,null,null,null,null,null,null,"",null,null,null,null,null,null,{"$f":"IF(C164<>\"\",IF(VLOOKUP(C164,Reference!$I$3:$J$188,2,FALSE)=\" \",0,VLOOKUP(C164,Reference!$I$3:$J$188,2,FALSE)),\"\")","v":""},{"$f":"IF(C164<>\"\",IF(VLOOKUP(C164,Reference!$M$3:$Q$188,5,FALSE)=\" \",0,VLOOKUP(C164,Reference!$M$3:$Q$188,5,FALSE)),\"\")","v":""}]
[null,null,null,null,null,null,null,null,null,null,null,null,null,null,null,null,null,null,null,{"$f":"IF(C165<>\"\",IF(VLOOKUP(C165,Reference!$A$3:$B$188,2,FALSE)=\"\",\"N/A\",VLOOKUP(C165,Reference!$A$3:$B$188,2,FALSE)),\"\")","v":""},null,null,null,"",null,null,null,null,null,null,null,null,"",null,null,null,null,null,null,{"$f":"IF(C165<>\"\",IF(VLOOKUP(C165,Reference!$I$3:$J$188,2,FALSE)=\" \",0,VLOOKUP(C165,Reference!$I$3:$J$188,2,FALSE)),\"\")","v":""},{"$f":"IF(C165<>\"\",IF(VLOOKUP(C165,Reference!$M$3:$Q$188,5,FALSE)=\" \",0,VLOOKUP(C165,Reference!$M$3:$Q$188,5,FALSE)),\"\")","v":""}]
[null,null,null,null,null,null,null,null,null,null,null,null,null,null,null,null,null,null,null,{"$f":"IF(C166<>\"\",IF(VLOOKUP(C166,Reference!$A$3:$B$188,2,FALSE)=\"\",\"N/A\",VLOOKUP(C166,Reference!$A$3:$B$188,2,FALSE)),\"\")","v":""},null,null,null,"",null,null,null,null,null,null,null,null,"",null,null,null,null,null,null,{"$f":"IF(C166<>\"\",IF(VLOOKUP(C166,Reference!$I$3:$J$188,2,FALSE)=\" \",0,VLOOKUP(C166,Reference!$I$3:$J$188,2,FALSE)),\"\")","v":""},{"$f":"IF(C166<>\"\",IF(VLOOKUP(C166,Reference!$M$3:$Q$188,5,FALSE)=\" \",0,VLOOKUP(C166,Reference!$M$3:$Q$188,5,FALSE)),\"\")","v":""}]
[null,null,null,null,null,null,null,null,null,null,null,null,null,null,null,null,null,null,null,{"$f":"IF(C167<>\"\",IF(VLOOKUP(C167,Reference!$A$3:$B$188,2,FALSE)=\"\",\"N/A\",VLOOKUP(C167,Reference!$A$3:$B$188,2,FALSE)),\"\")","v":""},null,null,null,"",null,null,null,null,null,null,null,null,"",null,null,null,null,null,null,{"$f":"IF(C167<>\"\",IF(VLOOKUP(C167,Reference!$I$3:$J$188,2,FALSE)=\" \",0,VLOOKUP(C167,Reference!$I$3:$J$188,2,FALSE)),\"\")","v":""},{"$f":"IF(C167<>\"\",IF(VLOOKUP(C167,Reference!$M$3:$Q$188,5,FALSE)=\" \",0,VLOOKUP(C167,Reference!$M$3:$Q$188,5,FALSE)),\"\")","v":""}]
[null,null,null,null,null,null,null,null,null,null,null,null,null,null,null,null,null,null,null,{"$f":"IF(C168<>\"\",IF(VLOOKUP(C168,Reference!$A$3:$B$188,2,FALSE)=\"\",\"N/A\",VLOOKUP(C168,Reference!$A$3:$B$188,2,FALSE)),\"\")","v":""},null,null,null,"",null,null,null,null,null,null,null,null,"",null,null,null,null,null,null,{"$f":"IF(C168<>\"\",IF(VLOOKUP(C168,Reference!$I$3:$J$188,2,FALSE)=\" \",0,VLOOKUP(C168,Reference!$I$3:$J$188,2,FALSE)),\"\")","v":""},{"$f":"IF(C168<>\"\",IF(VLOOKUP(C168,Reference!$M$3:$Q$188,5,FALSE)=\" \",0,VLOOKUP(C168,Reference!$M$3:$Q$188,5,FALSE)),\"\")","v":""}]
[null,null,null,null,null,null,null,null,null,null,null,null,null,null,null,null,null,null,null,{"$f":"IF(C169<>\"\",IF(VLOOKUP(C169,Reference!$A$3:$B$188,2,FALSE)=\"\",\"N/A\",VLOOKUP(C169,Reference!$A$3:$B$188,2,FALSE)),\"\")","v":""},null,null,null,"",null,null,null,null,null,null,null,null,"",null,null,null,null,null,null,{"$f":"IF(C169<>\"\",IF(VLOOKUP(C169,Reference!$I$3:$J$188,2,FALSE)=\" \",0,VLOOKUP(C169,Reference!$I$3:$J$188,2,FALSE)),\"\")","v":""},{"$f":"IF(C169<>\"\",IF(VLOOKUP(C169,Reference!$M$3:$Q$188,5,FALSE)=\" \",0,VLOOKUP(C169,Reference!$M$3:$Q$188,5,FALSE)),\"\")","v":""}]
[null,null,null,null,null,null,null,null,null,null,null,null,null,null,null,null,null,null,null,{"$f":"IF(C170<>\"\",IF(VLOOKUP(C170,Reference!$A$3:$B$188,2,FALSE)=\"\",\"N/A\",VLOOKUP(C170,Reference!$A$3:$B$188,2,FALSE)),\"\")","v":""},null,null,null,"",null,null,null,null,null,null,null,null,"",null,null,null,null,null,null,{"$f":"IF(C170<>\"\",IF(VLOOKUP(C170,Reference!$I$3:$J$188,2,FALSE)=\" \",0,VLOOKUP(C170,Reference!$I$3:$J$188,2,FALSE)),\"\")","v":""},{"$f":"IF(C170<>\"\",IF(VLOOKUP(C170,Reference!$M$3:$Q$188,5,FALSE)=\" \",0,VLOOKUP(C170,Reference!$M$3:$Q$188,5,FALSE)),\"\")","v":""}]

{"sheet":"Other Discharges","index":3,"n_rows":51,"n_cols":45,"rows_kept":51,"cut":false,"hidden":false,"merged":[[3,1,3,35],[49,18,49,21],[50,18,50,21],[11,22,11,26],[12,22,12,26],[17,22,17,26],[18,22,18,26],[19,22,19,26],[20,22,20,26],[50,22,50,26],[48,22,48,26],[48,18,48,21],[49,22,49,26],[45,18,45,21],[46,18,46,21],[47,18,47,21],[30,18,30,21],[31,18,31,21],[32,18,32,21],[5,18,5,23],[6,8,6,9],[37,1,37,10],[38,1,38,10],[6,18,6,23],[5,4,5,13],[6,24,6,26],[6,27,6,28],[6,29,6,33],[6,34,6,35],[34,12,34,17],[35,12,35,17],[36,12,36,17],[37,12,37,17],[23,1,23,10],[24,1,24,10],[25,1,25,10],[26,1,26,10],[29,1,29,10],[5,14,5,17],[32,1,32,10],[33,1,33,10],[34,1,34,10],[35,1,35,10],[36,1,36,10],[31,1,31,10],[12,1,12,10],[27,1,27,10],[17,1,17,10],[38,12,38,17],[5,24,5,28],[5,29,5,31],[6,10,6,17],[47,22,47,26],[31,22,31,26],[32,22,32,26],[33,22,33,26],[34,22,34,26],[35,22,35,26],[36,22,36,26],[38,22,38,26],[39,22,39,26],[45,1,45,10],[39,1,39,10],[40,1,40,10],[41,1,41,10],[42,1,42,10],[43,1,43,10],[5,1,5,3],[44,1,44,10],[20,1,20,10],[21,1,21,10],[22,1,22,10],[18,1,18,10],[19,1,19,10],[30,1,30,10],[21,12,21,17],[22,12,22,17],[23,12,23,17],[24,12,24,17],[25,12,25,17],[26,12,26,17],[27,12,27,17],[28,12,28,17],[29,12,29,17],[30,12,30,17],[28,1,28,10],[28,22,28,26],[29,22,29,26],[30,22,30,26],[21,22,21,26],[22,22,22,26],[23,22,23,26],[24,22,24,26],[25,22,25,26],[26,22,26,26],[27,22,27,26],[9,22,10,26],[13,1,13,10],[14,1,14,10],[15,1,15,10],[16,1,16,10],[9,18,10,21],[11,18,11,21],[22,27,22,30],[23,27,23,30],[11,1,11,10],[13,22,13,26],[14,22,14,26],[15,22,15,26],[16,22,16,26],[13,18,13,21],[14,18,14,21],[15,18,15,21],[16,18,16,21],[14,12,14,17],[18,18,18,21],[9,11,10,17],[9,1,10,10],[12,18,12,21],[17,18,17,21],[24,27,24,30],[25,27,25,30],[9,27,10,30],[11,27,11,30],[12,27,12,30],[13,27,13,30],[14,27,14,30],[15,27,15,30],[16,27,16,30],[41,27,41,30],[42,27,42,30],[43,27,43,30],[44,27,44,30],[15,12,15,17],[16,12,16,17],[17,12,17,17],[18,12,18,17],[19,12,19,17],[20,12,20,17],[19,18,19,21],[20,18,20,21],[21,18,21,21],[22,18,22,21],[23,18,23,21],[24,18,24,21],[25,18,25,21],[26,18,26,21],[17,27,17,30],[18,27,18,30],[19,27,19,30],[20,27,20,30],[21,27,21,30],[31,27,31,30],[32,27,32,30],[33,27,33,30],[34,27,34,30],[35,27,35,30],[36,27,36,30],[37,27,37,30],[38,27,38,30],[26,27,26,30],[27,27,27,30],[28,27,28,30],[29,27,29,30],[37,31,37,35],[38,31,38,35],[48,27,48,30],[49,27,49,30],[50,27,50,30],[9,31,10,35],[11,31,11,35],[12,31,12,35],[13,31,13,35],[14,31,14,35],[15,31,15,35],[16,31,16,35],[17,31,17,35],[18,31,18,35],[19,31,19,35],[20,31,20,35],[21,31,21,35],[22,31,22,35],[23,31,23,35],[24,31,24,35],[25,31,25,35],[26,31,26,35],[27,31,27,35],[30,27,30,30],[28,31,28,35],[29,31,29,35],[30,31,30,35],[31,31,31,35],[32,31,32,35],[33,31,33,35],[34,31,34,35],[35,31,35,35],[36,31,36,35],[45,22,45,26],[46,22,46,26],[43,18,43,21],[44,18,44,21],[50,1,50,10],[39,31,39,35],[40,31,40,35],[41,31,41,35],[42,31,42,35],[43,31,43,35],[44,31,44,35],[45,31,45,35],[39,27,39,30],[40,27,40,30],[45,27,45,30],[46,27,46,30],[47,27,47,30],[46,1,46,10],[47,1,47,10],[48,1,48,10],[49,1,49,10],[40,12,40,17],[41,12,41,17],[42,12,42,17],[4,1,4,35],[8,1,8,35],[0,0,50,0],[0,1,0,35],[46,31,46,35],[47,31,47,35],[48,31,48,35],[49,31,49,35],[50,31,50,35],[1,1,1,35],[2,1,2,35],[5,32,5,33],[5,34,5,35],[11,12,11,17],[12,12,12,17],[13,12,13,17],[37,22,37,26],[47,12,47,17],[46,12,46,17],[40,22,40,26],[41,22,41,26],[42,22,42,26],[43,22,43,26],[44,22,44,26],[7,8,7,9],[48,12,48,17],[49,12,49,17],[50,12,50,17],[31,12,31,17],[32,12,32,17],[33,12,33,17],[39,18,39,21],[40,18,40,21],[41,18,41,21],[42,18,42,21],[38,18,38,21],[37,18,37,21],[43,12,43,17],[39,12,39,17],[44,12,44,17],[45,12,45,17],[33,18,33,21],[34,18,34,21],[27,18,27,21],[28,18,28,21],[29,18,29,21],[36,18,36,21],[35,18,35,21]]}
[null,null,null,null,null,null,null,null,null,null,null,null,null,null,null,null,null,null,null,null,null,null,null,null,null,null,null,null,null,null,null,null,null,null,null,null,null,null,"<"]
[null,"TOXICS SCREENING ANALYSIS"]
[null,"WATER QUALITY POLLUTANTS OF CONCERN"]
[null,"VERSION 2.7"]
[null," "]
[null,"Facility:",null,null,null,null,null,null,null,null,null,null,null,null,null,null,null,null,"NPDES Permit No.:",null,null,null,null,null,null,null,null,null,null,null,null,null,"Outfall:",null,null,null,null,null,"Stream Flow (MGD)",null,{"$f":"IF(I8<>\"\",IF(I8<>0,I8*0.64631,0.000001),\"\")","v":""}]
[null,"Analysis Hardness (mg/L):",null,null,null,null,null,null,100,null,null,null,null,null,null,null,null,null,"Discharge Flow (MGD):",null,null,null,null,null,null,null,null,null,null,"Analysis pH (SU):",null,null,null,null,7,null,null,null,"Stream:Discharge",null,{"$f":"IF(AND(AO6<>\"\",Y7<>\"\"),AO6/Y7,\"\")","v":""}]
[null,"Stream Flow, Q7-10 (cfs):",null,null,null,null,null,null,null,null,null,null,null,null,null,null,null,null,null,null,null,null,null,null,null,null,null,null,null,null,null,null,null,null,null,null,null,null,"Assimilative Capacity?",null,{"$f":"IF(AO6=0,\"No\",IF(AO7<3,\"No\",\"Yes\"))","v":"Yes"}]
[]
[null,"Parameter",null,null,null,null,null,null,null,null,null,"Maximum Concentration in Application or DMRs (µg/L)",null,null,null,null,null,null,"Most Stringent Criterion (µg/L)",null,null,null,"Candidate for PENTOXSD Modeling?",null,null,null,null,"Most Stringent WQBEL (µg/L)",null,null,null,"Screening Recommendation"]
[null,null,null,null,null,null,null,null,null,null,null,null,null,null,null,null,null,null,null,null,null,null,null,null,null,null,null,null,null,null,null,null,null,null,null,null,null,null,"QL","Conservative?","BCS1M Screen 1","Screening Low","Screening High","BCS1M Screen 2","Final Rec."]
[null,"Total Dissolved Solids",null,null,null,null,null,null,null,null,null,null,null,null,null,null,null,null,{"$f":"IF(B12<>\"\",IF(VLOOKUP(B12,Reference!$A$3:$B$188,2,FALSE)=\"\",\"N/A\",VLOOKUP(B12,Reference!$A$3:$B$188,2,FALSE)),\"\")","v":500000},null,null,null,{"$f":"IF(AND(B12<>\"\",M12<>\"\",$I$8<>\"\",$Y$7<>\"\"),IF(S12<>\"N/A\",IF(AND(M12<=VALUE(AM12),L12=\"<\"),\"No (Value < QL)\",IF($AO$8=\"No\",IF(M12>=(0.5*S12),IF(AND(M12=\"<\",N12=(0.5*T12)),\"No\",\"Yes\"),\"No\"),IF(M12>=S12,IF(AND(M12=\"<\",N12=T12),\"No\",\"Yes\"),\"No\"))),\"No\"),\"\")","v":""},null,null,null,null,null,null,null,null,{"$f":"IF(M12<>\"\",AS12,\"\")","v":""},null,null,null,null,null,null,{"$f":"IF(B12<>\"\",IF(VLOOKUP(B12,Reference!$I$3:$J$188,2,FALSE)=\" \",0,VLOOKUP(B12,Reference!$I$3:$J$188,2,FALSE)),\"\")","v":2000},{"$f":"IF(B12<>\"\",IF(VLOOKUP(B12,Reference!$M$3:$Q$188,5,FALSE)=\" \",0,VLOOKUP(B12,Reference!$M$3:$Q$188,5,FALSE)),\"\")","v":"Y"},{"$f":"IF(AND(W12=\"Yes\",AB12<>\"\"),IF((M12/AB12)>=0.5,\"Establish Limits\",IF(AND(AN12=\"Y\",(M12/AB12)>0.1),\"Monitor\",IF(AND(AN12<>\"Y\",(M12/AB12)>0.25),\"Monitor\",\"No Limits/Monitoring\"))),\"\")","v":""},1000000,5000000,{"$f":"IF(AND(M12<>\"\",$Y$7<>\"\"),IF(OR(AND($Y$7>0.1,M12>AP12),AND($Y$7<=0.1,M12>AQ12),(($Y$7*(M12/1000)*8.34)>20000)),\"Monitor\",\"\"),\"\")","v":""},{"$f":"IF(OR(AO12=\"Establish Limits\",AO12=\"Monitor\"),AO12,IF(AND(AO12=\"No Limits/Monitoring\",AR12=\"Monitor\"),AR12,IF(AND(AO12=\"\",AR12=\"\"),\"\",IF(AND(AO12=\"\",AR12=\"Monitor\"),\"Monitor\",IF(AND(AO12=\"No Limits/Monitoring\",AR12=\"\"),\"No Limits/Monitoring\",\"\")))))","v":""}]
[null,"Chloride",null,null,null,null,null,null,null,null,null,null,null,null,null,null,null,null,{"$f":"IF(B13<>\"\",IF(VLOOKUP(B13,Reference!$A$3:$B$188,2,FALSE)=\"\",\"N/A\",VLOOKUP(B13,Reference!$A$3:$B$188,2,FALSE)),\"\")","v":250000},null,null,null,{"$f":"IF(AND(B13<>\"\",M13<>\"\",$I$8<>\"\",$Y$7<>\"\"),IF(S13<>\"N/A\",IF(AND(M13<=VALUE(AM13),L13=\"<\"),\"No (Value < QL)\",IF($AO$8=\"No\",IF(M13>=(0.5*S13),IF(AND(M13=\"<\",N13=(0.5*T13)),\"No\",\"Yes\"),\"No\"),IF(M13>=S13,IF(AND(M13=\"<\",N13=T13),\"No\",\"Yes\"),\"No\"))),\"No\"),\"\")","v":""},null,null,null,null,null,null,null,null,{"$f":"AS13","v":""},null,null,null,null,null,null,{"$f":"IF(B13<>\"\",IF(VLOOKUP(B13,Reference!$I$3:$J$188,2,FALSE)=\" \",0,VLOOKUP(B13,Reference!$I$3:$J$188,2,FALSE)),\"\")","v":500},{"$f":"IF(B13<>\"\",IF(VLOOKUP(B13,Reference!$M$3:$Q$188,5,FALSE)=\" \",0,VLOOKUP(B13,Reference!$M$3:$Q$188,5,FALSE)),\"\")","v":"Y"},{"$f":"IF(AND(W13=\"Yes\",AB13<>\"\"),IF((M13/AB13)>=0.5,\"Establish Limits\",IF(AND(AN13=\"Y\",(M13/AB13)>0.1),\"Monitor\",IF(AND(AN13<>\"Y\",(M13/AB13)>0.25),\"Monitor\",\"No Limits/Monitoring\"))),\"\")","v":""},null,null,null,{"$f":"IF(OR(AO13=\"Establish Limits\",AO13=\"Monitor\"),AO13,IF(AND(AO13=\"\",OR($AS$12=\"No Limits/Monitoring\",$AS$12=\"\")),\"\",IF(AND(OR(AO13=\"\",AO13=\"No Limits/Monitoring\"),OR($AS$12=\"Monitor\",$AS$12=\"Establish Limits\")),\"Monitor\",IF(AND(AO13=\"No Limits/Monitoring\",$AS$12=\"\"),AO13))))","v":""}]
[null,"Bromide",null,null,null,null,null,null,null,null,null,null,null,null,null,null,null,null,{"$f":"IF(B14<>\"\",IF(VLOOKUP(B14,Reference!$A$3:$B$188,2,FALSE)=\"\",\"N/A\",VLOOKUP(B14,Reference!$A$3:$B$188,2,FALSE)),\"\")","v":"N/A"},null,null,null,"",null,null,null,null,null,null,null,null,{"$f":"AS14","v":""},null,null,null,null,null,null,{"$f":"IF(B14<>\"\",IF(VLOOKUP(B14,Reference!$I$3:$J$188,2,FALSE)=\" \",0,VLOOKUP(B14,Reference!$I$3:$J$188,2,FALSE)),\"\")","v":200},{"$f":"IF(B14<>\"\",IF(VLOOKUP(B14,Reference!$M$3:$Q$188,5,FALSE)=\" \",0,VLOOKUP(B14,Reference!$M$3:$Q$188,5,FALSE)),\"\")","v":"Y"},"",1000,10000,{"$f":"IF(AND(M14<>\"\",$Y$7<>\"\"),IF(OR(AND($Y$7>0.1,M14>AP14),AND($Y$7<=0.1,M14>AQ14)),\"Monitor\",\"\"),\"\")","v":""},{"$f":"IF(OR(AO14=\"Establish Limits\",AO14=\"Monitor\"),AO14,IF(AND(AO14=\"No Limits/Monitoring\",AR14=\"Monitor\"),AR14,IF(AND(AO14=\"\",AR14=\"\",$AS$12=\"\"),\"\",IF(AND(AO14=\"\",AR14=\"Monitor\"),\"Monitor\",IF(AND(AO14=\"\",AR14=\"\",OR($AS$12=\"Monitor\",$AS$12=\"Establish Limits\")),\"Monitor\",\"\")))))","v":""}]
[null,"Sulfate",null,null,null,null,null,null,null,null,null,null,null,null,null,null,null,null,{"$f":"IF(B15<>\"\",IF(VLOOKUP(B15,Reference!$A$3:$B$188,2,FALSE)=\"\",\"N/A\",VLOOKUP(B15,Reference!$A$3:$B$188,2,FALSE)),\"\")","v":250000},null,null,null,"",null,null,null,null,null,null,null,null,{"$f":"AS15","v":""},null,null,null,null,null,null,{"$f":"IF(B15<>\"\",IF(VLOOKUP(B15,Reference!$I$3:$J$188,2,FALSE)=\" \",0,VLOOKUP(B15,Reference!$I$3:$J$188,2,FALSE)),\"\")","v":1000},{"$f":"IF(B15<>\"\",IF(VLOOKUP(B15,Reference!$M$3:$Q$188,5,FALSE)=\" \",0,VLOOKUP(B15,Reference!$M$3:$Q$188,5,FALSE)),\"\")","v":"Y"},"",null,null,null,{"$f":"IF(OR(AO15=\"Establish Limits\",AO15=\"Monitor\"),AO15,IF(AND(AO15=\"\",OR($AS$12=\"No Limits/Monitoring\",$AS$12=\"\")),\"\",IF(AND(OR(AO15=\"\",AO15=\"No Limits/Monitoring\"),OR($AS$12=\"Monitor\",$AS$12=\"Establish Limits\")),\"Monitor\",IF(AND(AO15=\"No Limits/Monitoring\",$AS$12=\"\"),AO15))))","v":""}]
[null,"1,4-Dioxane",null,null,null,null,null,null,null,null,null,null,null,null,null,null,null,null,{"$f":"IF(B16<>\"\",IF(VLOOKUP(B16,Reference!$A$3:$B$188,2,FALSE)=\"\",\"N/A\",VLOOKUP(B16,Reference!$A$3:$B$188,2,FALSE)),\"\")","v":"N/A"},null,null,null,"",null,null,null,null,null,null,null,null,{"$f":"IF(M16<>\"\",AS16,\"\")","v":""},null,null,null,null,null,null,{"$f":"IF(B16<>\"\",IF(VLOOKUP(B16,Reference!$I$3:$J$188,2,FALSE)=\" \",0,VLOOKUP(B16,Reference!$I$3:$J$188,2,FALSE)),\"\")","v":1},{"$f":"IF(B16<>\"\",IF(VLOOKUP(B16,Reference!$M$3:$Q$188,5,FALSE)=\" \",0,VLOOKUP(B16,Reference!$M$3:$Q$188,5,FALSE)),\"\")","v":0},"",10,100,{"$f":"IF(AND($Y$7<>\"\",M16<>\"\"),IF(OR(AND($Y$7>0.1,M16>AP16),(AND($Y$7<=0.1,M16>AQ16))),\"Monitor\",\"\"),\"\")","v":""},{"$f":"IF(OR(AO16=\"Establish Limits\",AO16=\"Monitor\"),AO16,IF(AND(AO16=\"No Limits/Monitoring\",AR16=\"Monitor\"),AR16,IF(AND(AO16=\"\",AR16=\"\"),\"\",IF(AND(AO16=\"\",AR16=\"Monitor\"),\"Monitor\",IF(AND(AO16=\"\",AR16=\"\"),\"Monitor\",\"\")))))","v":""}]
[null,null,null,null,null,null,null,null,null,null,null,null,null,null,null,null,null,null,{"$f":"IF(B17<>\"\",IF(VLOOKUP(B17,Reference!$A$3:$B$188,2,FALSE)=\"\",\"N/A\",VLOOKUP(B17,Reference!$A$3:$B$188,2,FALSE)),\"\")","v":""},null,null,null,"",null,null,null,null,null,null,null,null,{"$f":"IF(M17<>\"\",IF(AND(W17=\"Yes\",AB17<>\"\"),IF((M17/AB17)>=0.5,\"Establish Limits\",IF(AND(AN17=\"Y\",(M17/AB17)>0.1),\"Monitor\",IF(AND(AN17<>\"Y\",(M17/AB17)>0.25),\"Monitor\",\"No Limits/Monitoring\"))),\"\"),\"\")","v":""},null,null,null,null,null,null,{"$f":"IF(B17<>\"\",IF(VLOOKUP(B17,Reference!$I$3:$J$188,2,FALSE)=\" \",0,VLOOKUP(B17,Reference!$I$3:$J$188,2,FALSE)),\"\")","v":""},{"$f":"IF(B17<>\"\",IF(VLOOKUP(B17,Reference!$M$3:$Q$188,5,FALSE)=\" \",0,VLOOKUP(B17,Reference!$M$3:$Q$188,5,FALSE)),\"\")","v":""}]
[null,null,null,null,null,null,null,null,null,null,null,null,null,null,null,null,null,null,{"$f":"IF(B18<>\"\",IF(VLOOKUP(B18,Reference!$A$3:$B$188,2,FALSE)=\"\",\"N/A\",VLOOKUP(B18,Reference!$A$3:$B$188,2,FALSE)),\"\")","v":""},null,null,null,"",null,null,null,null,null,null,null,null,{"$f":"IF(M18<>\"\",IF(AND(W18=\"Yes\",AB18<>\"\"),IF((M18/AB18)>=0.5,\"Establish Limits\",IF(AND(AN18=\"Y\",(M18/AB18)>0.1),\"Monitor\",IF(AND(AN18<>\"Y\",(M18/AB18)>0.25),\"Monitor\",\"No Limits/Monitoring\"))),\"\"),\"\")","v":""},null,null,null,null,null,null,{"$f":"IF(B18<>\"\",IF(VLOOKUP(B18,Reference!$I$3:$J$188,2,FALSE)=\" \",0,VLOOKUP(B18,Reference!$I$3:$J$188,2,FALSE)),\"\")","v":""},{"$f":"IF(B18<>\"\",IF(VLOOKUP(B18,Reference!$M$3:$Q$188,5,FALSE)=\" \",0,VLOOKUP(B18,Reference!$M$3:$Q$188,5,FALSE)),\"\")","v":""}]
[null,null,null,null,null,null,null,null,null,null,null,null,null,null,null,null,null,null,{"$f":"IF(B19<>\"\",IF(VLOOKUP(B19,Reference!$A$3:$B$188,2,FALSE)=\"\",\"N/A\",VLOOKUP(B19,Reference!$A$3:$B$188,2,FALSE)),\"\")","v":""},null,null,null,"",null,null,null,null,null,null,null,null,"",null,null,null,null,null,null,{"$f":"IF(B19<>\"\",IF(VLOOKUP(B19,Reference!$I$3:$J$188,2,FALSE)=\" \",0,VLOOKUP(B19,Reference!$I$3:$J$188,2,FALSE)),\"\")","v":""},{"$f":"IF(B19<>\"\",IF(VLOOKUP(B19,Reference!$M$3:$Q$188,5,FALSE)=\" \",0,VLOOKUP(B19,Reference!$M$3:$Q$188,5,FALSE)),\"\")","v":""}]
[null,null,null,null,null,null,null,null,null,null,null,null,null,null,null,null,null,null,{"$f":"IF(B20<>\"\",IF(VLOOKUP(B20,Reference!$A$3:$B$188,2,FALSE)=\"\",\"N/A\",VLOOKUP(B20,Reference!$A$3:$B$188,2,FALSE)),\"\")","v":""},null,null,null,"",null,null,null,null,null,null,null,null,"",null,null,null,null,null,null,{"$f":"IF(B20<>\"\",IF(VLOOKUP(B20,Reference!$I$3:$J$188,2,FALSE)=\" \",0,VLOOKUP(B20,Reference!$I$3:$J$188,2,FALSE)),\"\")","v":""},{"$f":"IF(B20<>\"\",IF(VLOOKUP(B20,Reference!$M$3:$Q$188,5,FALSE)=\" \",0,VLOOKUP(B20,Reference!$M$3:$Q$188,5,FALSE)),\"\")","v":""}]
[null,null,null,null,null,null,null,null,null,null,null,null,null,null,null,null,null,null,{"$f":"IF(B21<>\"\",IF(VLOOKUP(B21,Reference!$A$3:$B$188,2,FALSE)=\"\",\"N/A\",VLOOKUP(B21,Reference!$A$3:$B$188,2,FALSE)),\"\")","v":""},null,null,null,"",null,null,null,null,null,null,null,null,"",null,null,null,null,null,null,{"$f":"IF(B21<>\"\",IF(VLOOKUP(B21,Reference!$I$3:$J$188,2,FALSE)=\" \",0,VLOOKUP(B21,Reference!$I$3:$J$188,2,FALSE)),\"\")","v":""},{"$f":"IF(B21<>\"\",IF(VLOOKUP(B21,Reference!$M$3:$Q$188,5,FALSE)=\" \",0,VLOOKUP(B21,Reference!$M$3:$Q$188,5,FALSE)),\"\")","v":""}]
[null,null,null,null,null,null,null,null,null,null,null,null,null,null,null,null,null,null,{"$f":"IF(B22<>\"\",IF(VLOOKUP(B22,Reference!$A$3:$B$188,2,FALSE)=\"\",\"N/A\",VLOOKUP(B22,Reference!$A$3:$B$188,2,FALSE)),\"\")","v":""},null,null,null,"",null,null,null,null,null,null,null,null,"",null,null,null,null,null,null,{"$f":"IF(B22<>\"\",IF(VLOOKUP(B22,Reference!$I$3:$J$188,2,FALSE)=\" \",0,VLOOKUP(B22,Reference!$I$3:$J$188,2,FALSE)),\"\")","v":""},{"$f":"IF(B22<>\"\",IF(VLOOKUP(B22,Reference!$M$3:$Q$188,5,FALSE)=\" \",0,VLOOKUP(B22,Reference!$M$3:$Q$188,5,FALSE)),\"\")","v":""}]
[null,null,null,null,null,null,null,null,null,null,null,null,null,null,null,null,null,null,{"$f":"IF(B23<>\"\",IF(VLOOKUP(B23,Reference!$A$3:$B$188,2,FALSE)=\"\",\"N/A\",VLOOKUP(B23,Reference!$A$3:$B$188,2,FALSE)),\"\")","v":""},null,null,null,"",null,null,null,null,null,null,null,null,"",null,null,null,null,null,null,{"$f":"IF(B23<>\"\",IF(VLOOKUP(B23,Reference!$I$3:$J$188,2,FALSE)=\" \",0,VLOOKUP(B23,Reference!$I$3:$J$188,2,FALSE)),\"\")","v":""},{"$f":"IF(B23<>\"\",IF(VLOOKUP(B23,Reference!$M$3:$Q$188,5,FALSE)=\" \",0,VLOOKUP(B23,Reference!$M$3:$Q$188,5,FALSE)),\"\")","v":""}]
[null,null,null,null,null,null,null,null,null,null,null,null,null,null,null,null,null,null,{"$f":"IF(B24<>\"\",IF(VLOOKUP(B24,Reference!$A$3:$B$188,2,FALSE)=\"\",\"N/A\",VLOOKUP(B24,Reference!$A$3:$B$188,2,FALSE)),\"\")","v":""},null,null,null,"",null,null,null,null,null,null,null,null,"",null,null,null,null,null,null,{"$f":"IF(B24<>\"\",IF(VLOOKUP(B24,Reference!$I$3:$J$188,2,FALSE)=\" \",0,VLOOKUP(B24,Reference!$I$3:$J$188,2,FALSE)),\"\")","v":""},{"$f":"IF(B24<>\"\",IF(VLOOKUP(B24,Reference!$M$3:$Q$188,5,FALSE)=\" \",0,VLOOKUP(B24,Reference!$M$3:$Q$188,5,FALSE)),\"\")","v":""}]
[null,null,null,null,null,null,null,null,null,null,null,null,null,null,null,null,null,null,{"$f":"IF(B25<>\"\",IF(VLOOKUP(B25,Reference!$A$3:$B$188,2,FALSE)=\"\",\"N/A\",VLOOKUP(B25,Reference!$A$3:$B$188,2,FALSE)),\"\")","v":""},null,null,null,"",null,null,null,null,null,null,null,null,"",null,null,null,null,null,null,{"$f":"IF(B25<>\"\",IF(VLOOKUP(B25,Reference!$I$3:$J$188,2,FALSE)=\" \",0,VLOOKUP(B25,Reference!$I$3:$J$188,2,FALSE)),\"\")","v":""},{"$f":"IF(B25<>\"\",IF(VLOOKUP(B25,Reference!$M$3:$Q$188,5,FALSE)=\" \",0,VLOOKUP(B25,Reference!$M$3:$Q$188,5,FALSE)),\"\")","v":""}]
[null,null,null,null,null,null,null,null,null,null,null,null,null,null,null,null,null,null,{"$f":"IF(B26<>\"\",IF(VLOOKUP(B26,Reference!$A$3:$B$188,2,FALSE)=\"\",\"N/A\",VLOOKUP(B26,Reference!$A$3:$B$188,2,FALSE)),\"\")","v":""},null,null,null,"",null,null,null,null,null,null,null,null,"",null,null,null,null,null,null,{"$f":"IF(B26<>\"\",IF(VLOOKUP(B26,Reference!$I$3:$J$188,2,FALSE)=\" \",0,VLOOKUP(B26,Reference!$I$3:$J$188,2,FALSE)),\"\")","v":""},{"$f":"IF(B26<>\"\",IF(VLOOKUP(B26,Reference!$M$3:$Q$188,5,FALSE)=\" \",0,VLOOKUP(B26,Reference!$M$3:$Q$188,5,FALSE)),\"\")","v":""}]
[null,null,null,null,null,null,null,null,null,null,null,null,null,null,null,null,null,null,{"$f":"IF(B27<>\"\",IF(VLOOKUP(B27,Reference!$A$3:$B$188,2,FALSE)=\"\",\"N/A\",VLOOKUP(B27,Reference!$A$3:$B$188,2,FALSE)),\"\")","v":""},null,null,null,"",null,null,null,null,null,null,null,null,"",null,null,null,null,null,null,{"$f":"IF(B27<>\"\",IF(VLOOKUP(B27,Reference!$I$3:$J$188,2,FALSE)=\" \",0,VLOOKUP(B27,Reference!$I$3:$J$188,2,FALSE)),\"\")","v":""},{"$f":"IF(B27<>\"\",IF(VLOOKUP(B27,Reference!$M$3:$Q$188,5,FALSE)=\" \",0,VLOOKUP(B27,Reference!$M$3:$Q$188,5,FALSE)),\"\")","v":""}]
[null,null,null,null,null,null,null,null,null,null,null,null,null,null,null,null,null,null,{"$f":"IF(B28<>\"\",IF(VLOOKUP(B28,Reference!$A$3:$B$188,2,FALSE)=\"\",\"N/A\",VLOOKUP(B28,Reference!$A$3:$B$188,2,FALSE)),\"\")","v":""},null,null,null,"",null,null,null,null,null,null,null,null,"",null,null,null,null,null,null,{"$f":"IF(B28<>\"\",IF(VLOOKUP(B28,Reference!$I$3:$J$188,2,FALSE)=\" \",0,VLOOKUP(B28,Reference!$I$3:$J$188,2,FALSE)),\"\")","v":""},{"$f":"IF(B28<>\"\",IF(VLOOKUP(B28,Reference!$M$3:$Q$188,5,FALSE)=\" \",0,VLOOKUP(B28,Reference!$M$3:$Q$188,5,FALSE)),\"\")","v":""}]
[null,null,null,null,null,null,null,null,null,null,null,null,null,null,null,null,null,null,{"$f":"IF(B29<>\"\",IF(VLOOKUP(B29,Reference!$A$3:$B$188,2,FALSE)=\"\",\"N/A\",VLOOKUP(B29,Reference!$A$3:$B$188,2,FALSE)),\"\")","v":""},null,null,null,"",null,null,null,null,null,null,null,null,"",null,null,null,null,null,null,{"$f":"IF(B29<>\"\",IF(VLOOKUP(B29,Reference!$I$3:$J$188,2,FALSE)=\" \",0,VLOOKUP(B29,Reference!$I$3:$J$188,2,FALSE)),\"\")","v":""},{"$f":"IF(B29<>\"\",IF(VLOOKUP(B29,Reference!$M$3:$Q$188,5,FALSE)=\" \",0,VLOOKUP(B29,Reference!$M$3:$Q$188,5,FALSE)),\"\")","v":""}]
[null,null,null,null,null,null,null,null,null,null,null,null,null,null,null,null,null,null,{"$f":"IF(B30<>\"\",IF(VLOOKUP(B30,Reference!$A$3:$B$188,2,FALSE)=\"\",\"N/A\",VLOOKUP(B30,Reference!$A$3:$B$188,2,FALSE)),\"\")","v":""},null,null,null,"",null,null,null,null,null,null,null,null,"",null,null,null,null,null,null,{"$f":"IF(B30<>\"\",IF(VLOOKUP(B30,Reference!$I$3:$J$188,2,FALSE)=\" \",0,VLOOKUP(B30,Reference!$I$3:$J$188,2,FALSE)),\"\")","v":""},{"$f":"IF(B30<>\"\",IF(VLOOKUP(B30,Reference!$M$3:$Q$188,5,FALSE)=\" \",0,VLOOKUP(B30,Reference!$M$3:$Q$188,5,FALSE)),\"\")","v":""}]
[null,null,null,null,null,null,null,null,null,null,null,null,null,null,null,null,null,null,{"$f":"IF(B31<>\"\",IF(VLOOKUP(B31,Reference!$A$3:$B$188,2,FALSE)=\"\",\"N/A\",VLOOKUP(B31,Reference!$A$3:$B$188,2,FALSE)),\"\")","v":""},null,null,null,"",null,null,null,null,null,null,null,null,"",null,null,null,null,null,null,{"$f":"IF(B31<>\"\",IF(VLOOKUP(B31,Reference!$I$3:$J$188,2,FALSE)=\" \",0,VLOOKUP(B31,Reference!$I$3:$J$188,2,FALSE)),\"\")","v":""},{"$f":"IF(B31<>\"\",IF(VLOOKUP(B31,Reference!$M$3:$Q$188,5,FALSE)=\" \",0,VLOOKUP(B31,Reference!$M$3:$Q$188,5,FALSE)),\"\")","v":""}]
[null,null,null,null,null,null,null,null,null,null,null,null,null,null,null,null,null,null,{"$f":"IF(B32<>\"\",IF(VLOOKUP(B32,Reference!$A$3:$B$188,2,FALSE)=\"\",\"N/A\",VLOOKUP(B32,Reference!$A$3:$B$188,2,FALSE)),\"\")","v":""},null,null,null,"",null,null,null,null,null,null,null,null,"",null,null,null,null,null,null,{"$f":"IF(B32<>\"\",IF(VLOOKUP(B32,Reference!$I$3:$J$188,2,FALSE)=\" \",0,VLOOKUP(B32,Reference!$I$3:$J$188,2,FALSE)),\"\")","v":""},{"$f":"IF(B32<>\"\",IF(VLOOKUP(B32,Reference!$M$3:$Q$188,5,FALSE)=\" \",0,VLOOKUP(B32,Reference!$M$3:$Q$188,5,FALSE)),\"\")","v":""}]
[null,null,null,null,null,null,null,null,null,null,null,null,null,null,null,null,null,null,{"$f":"IF(B33<>\"\",IF(VLOOKUP(B33,Reference!$A$3:$B$188,2,FALSE)=\"\",\"N/A\",VLOOKUP(B33,Reference!$A$3:$B$188,2,FALSE)),\"\")","v":""},null,null,null,"",null,null,null,null,null,null,null,null,"",null,null,null,null,null,null,{"$f":"IF(B33<>\"\",IF(VLOOKUP(B33,Reference!$I$3:$J$188,2,FALSE)=\" \",0,VLOOKUP(B33,Reference!$I$3:$J$188,2,FALSE)),\"\")","v":""},{"$f":"IF(B33<>\"\",IF(VLOOKUP(B33,Reference!$M$3:$Q$188,5,FALSE)=\" \",0,VLOOKUP(B33,Reference!$M$3:$Q$188,5,FALSE)),\"\")","v":""}]
[null,null,null,null,null,null,null,null,null,null,null,null,null,null,null,null,null,null,{"$f":"IF(B34<>\"\",IF(VLOOKUP(B34,Reference!$A$3:$B$188,2,FALSE)=\"\",\"N/A\",VLOOKUP(B34,Reference!$A$3:$B$188,2,FALSE)),\"\")","v":""},null,null,null,"",null,null,null,null,null,null,null,null,"",null,null,null,null,null,null,{"$f":"IF(B34<>\"\",IF(VLOOKUP(B34,Reference!$I$3:$J$188,2,FALSE)=\" \",0,VLOOKUP(B34,Reference!$I$3:$J$188,2,FALSE)),\"\")","v":""},{"$f":"IF(B34<>\"\",IF(VLOOKUP(B34,Reference!$M$3:$Q$188,5,FALSE)=\" \",0,VLOOKUP(B34,Reference!$M$3:$Q$188,5,FALSE)),\"\")","v":""}]
[null,null,null,null,null,null,null,null,null,null,null,null,null,null,null,null,null,null,{"$f":"IF(B35<>\"\",IF(VLOOKUP(B35,Reference!$A$3:$B$188,2,FALSE)=\"\",\"N/A\",VLOOKUP(B35,Reference!$A$3:$B$188,2,FALSE)),\"\")","v":""},null,null,null,"",null,null,null,null,null,null,null,null,"",null,null,null,null,null,null,{"$f":"IF(B35<>\"\",IF(VLOOKUP(B35,Reference!$I$3:$J$188,2,FALSE)=\" \",0,VLOOKUP(B35,Reference!$I$3:$J$188,2,FALSE)),\"\")","v":""},{"$f":"IF(B35<>\"\",IF(VLOOKUP(B35,Reference!$M$3:$Q$188,5,FALSE)=\" \",0,VLOOKUP(B35,Reference!$M$3:$Q$188,5,FALSE)),\"\")","v":""}]
[null,null,null,null,null,null,null,null,null,null,null,null,null,null,null,null,null,null,{"$f":"IF(B36<>\"\",IF(VLOOKUP(B36,Reference!$A$3:$B$188,2,FALSE)=\"\",\"N/A\",VLOOKUP(B36,Reference!$A$3:$B$188,2,FALSE)),\"\")","v":""},null,null,null,"",null,null,null,null,null,null,null,null,"",null,null,null,null,null,null,{"$f":"IF(B36<>\"\",IF(VLOOKUP(B36,Reference!$I$3:$J$188,2,FALSE)=\" \",0,VLOOKUP(B36,Reference!$I$3:$J$188,2,FALSE)),\"\")","v":""},{"$f":"IF(B36<>\"\",IF(VLOOKUP(B36,Reference!$M$3:$Q$188,5,FALSE)=\" \",0,VLOOKUP(B36,Reference!$M$3:$Q$188,5,FALSE)),\"\")","v":""}]
[null,null,null,null,null,null,null,null,null,null,null,null,null,null,null,null,null,null,{"$f":"IF(B37<>\"\",IF(VLOOKUP(B37,Reference!$A$3:$B$188,2,FALSE)=\"\",\"N/A\",VLOOKUP(B37,Reference!$A$3:$B$188,2,FALSE)),\"\")","v":""},null,null,null,"",null,null,null,null,null,null,null,null,"",null,null,null,null,null,null,{"$f":"IF(B37<>\"\",IF(VLOOKUP(B37,Reference!$I$3:$J$188,2,FALSE)=\" \",0,VLOOKUP(B37,Reference!$I$3:$J$188,2,FALSE)),\"\")","v":""},{"$f":"IF(B37<>\"\",IF(VLOOKUP(B37,Reference!$M$3:$Q$188,5,FALSE)=\" \",0,VLOOKUP(B37,Reference!$M$3:$Q$188,5,FALSE)),\"\")","v":""}]
[null,null,null,null,null,null,null,null,null,null,null,null,null,null,null,null,null,null,{"$f":"IF(B38<>\"\",IF(VLOOKUP(B38,Reference!$A$3:$B$188,2,FALSE)=\"\",\"N/A\",VLOOKUP(B38,Reference!$A$3:$B$188,2,FALSE)),\"\")","v":""},null,null,null,"",null,null,null,null,null,null,null,null,"",null,null,null,null,null,null,{"$f":"IF(B38<>\"\",IF(VLOOKUP(B38,Reference!$I$3:$J$188,2,FALSE)=\" \",0,VLOOKUP(B38,Reference!$I$3:$J$188,2,FALSE)),\"\")","v":""},{"$f":"IF(B38<>\"\",IF(VLOOKUP(B38,Reference!$M$3:$Q$188,5,FALSE)=\" \",0,VLOOKUP(B38,Reference!$M$3:$Q$188,5,FALSE)),\"\")","v":""}]
[null,null,null,null,null,null,null,null,null,null,null,null,null,null,null,null,null,null,{"$f":"IF(B39<>\"\",IF(VLOOKUP(B39,Reference!$A$3:$B$188,2,FALSE)=\"\",\"N/A\",VLOOKUP(B39,Reference!$A$3:$B$188,2,FALSE)),\"\")","v":""},null,null,null,"",null,null,null,null,null,null,null,null,"",null,null,null,null,null,null,{"$f":"IF(B39<>\"\",IF(VLOOKUP(B39,Reference!$I$3:$J$188,2,FALSE)=\" \",0,VLOOKUP(B39,Reference!$I$3:$J$188,2,FALSE)),\"\")","v":""},{"$f":"IF(B39<>\"\",IF(VLOOKUP(B39,Reference!$M$3:$Q$188,5,FALSE)=\" \",0,VLOOKUP(B39,Reference!$M$3:$Q$188,5,FALSE)),\"\")","v":""}]
[null,null,null,null,null,null,null,null,null,null,null,null,null,null,null,null,null,null,{"$f":"IF(B40<>\"\",IF(VLOOKUP(B40,Reference!$A$3:$B$188,2,FALSE)=\"\",\"N/A\",VLOOKUP(B40,Reference!$A$3:$B$188,2,FALSE)),\"\")","v":""},null,null,null,"",null,null,null,null,null,null,null,null,"",null,null,null,null,null,null,{"$f":"IF(B40<>\"\",IF(VLOOKUP(B40,Reference!$I$3:$J$188,2,FALSE)=\" \",0,VLOOKUP(B40,Reference!$I$3:$J$188,2,FALSE)),\"\")","v":""},{"$f":"IF(B40<>\"\",IF(VLOOKUP(B40,Reference!$M$3:$Q$188,5,FALSE)=\" \",0,VLOOKUP(B40,Reference!$M$3:$Q$188,5,FALSE)),\"\")","v":""}]
[null,null,null,null,null,null,null,null,null,null,null,null,null,null,null,null,null,null,{"$f":"IF(B41<>\"\",IF(VLOOKUP(B41,Reference!$A$3:$B$188,2,FALSE)=\"\",\"N/A\",VLOOKUP(B41,Reference!$A$3:$B$188,2,FALSE)),\"\")","v":""},null,null,null,"",null,null,null,null,null,null,null,null,"",null,null,null,null,null,null,{"$f":"IF(B41<>\"\",IF(VLOOKUP(B41,Reference!$I$3:$J$188,2,FALSE)=\" \",0,VLOOKUP(B41,Reference!$I$3:$J$188,2,FALSE)),\"\")","v":""},{"$f":"IF(B41<>\"\",IF(VLOOKUP(B41,Reference!$M$3:$Q$188,5,FALSE)=\" \",0,VLOOKUP(B41,Reference!$M$3:$Q$188,5,FALSE)),\"\")","v":""}]
[null,null,null,null,null,null,null,null,null,null,null,null,null,null,null,null,null,null,{"$f":"IF(B42<>\"\",IF(VLOOKUP(B42,Reference!$A$3:$B$188,2,FALSE)=\"\",\"N/A\",VLOOKUP(B42,Reference!$A$3:$B$188,2,FALSE)),\"\")","v":""},null,null,null,"",null,null,null,null,null,null,null,null,"",null,null,null,null,null,null,{"$f":"IF(B42<>\"\",IF(VLOOKUP(B42,Reference!$I$3:$J$188,2,FALSE)=\" \",0,VLOOKUP(B42,Reference!$I$3:$J$188,2,FALSE)),\"\")","v":""},{"$f":"IF(B42<>\"\",IF(VLOOKUP(B42,Reference!$M$3:$Q$188,5,FALSE)=\" \",0,VLOOKUP(B42,Reference!$M$3:$Q$188,5,FALSE)),\"\")","v":""}]
[null,null,null,null,null,null,null,null,null,null,null,null,null,null,null,null,null,null,{"$f":"IF(B43<>\"\",IF(VLOOKUP(B43,Reference!$A$3:$B$188,2,FALSE)=\"\",\"N/A\",VLOOKUP(B43,Reference!$A$3:$B$188,2,FALSE)),\"\")","v":""},null,null,null,"",null,null,null,null,null,null,null,null,"",null,null,null,null,null,null,{"$f":"IF(B43<>\"\",IF(VLOOKUP(B43,Reference!$I$3:$J$188,2,FALSE)=\" \",0,VLOOKUP(B43,Reference!$I$3:$J$188,2,FALSE)),\"\")","v":""},{"$f":"IF(B43<>\"\",IF(VLOOKUP(B43,Reference!$M$3:$Q$188,5,FALSE)=\" \",0,VLOOKUP(B43,Reference!$M$3:$Q$188,5,FALSE)),\"\")","v":""}]
[null,null,null,null,null,null,null,null,null,null,null,null,null,null,null,null,null,null,{"$f":"IF(B44<>\"\",IF(VLOOKUP(B44,Reference!$A$3:$B$188,2,FALSE)=\"\",\"N/A\",VLOOKUP(B44,Reference!$A$3:$B$188,2,FALSE)),\"\")","v":""},null,null,null,"",null,null,null,null,null,null,null,null,"",null,null,null,null,null,null,{"$f":"IF(B44<>\"\",IF(VLOOKUP(B44,Reference!$I$3:$J$188,2,FALSE)=\" \",0,VLOOKUP(B44,Reference!$I$3:$J$188,2,FALSE)),\"\")","v":""},{"$f":"IF(B44<>\"\",IF(VLOOKUP(B44,Reference!$M$3:$Q$188,5,FALSE)=\" \",0,VLOOKUP(B44,Reference!$M$3:$Q$188,5,FALSE)),\"\")","v":""}]
[null,null,null,null,null,null,null,null,null,null,null,null,null,null,null,null,null,null,{"$f":"IF(B45<>\"\",IF(VLOOKUP(B45,Reference!$A$3:$B$188,2,FALSE)=\"\",\"N/A\",VLOOKUP(B45,Reference!$A$3:$B$188,2,FALSE)),\"\")","v":""},null,null,null,"",null,null,null,null,null,null,null,null,"",null,null,null,null,null,null,{"$f":"IF(B45<>\"\",IF(VLOOKUP(B45,Reference!$I$3:$J$188,2,FALSE)=\" \",0,VLOOKUP(B45,Reference!$I$3:$J$188,2,FALSE)),\"\")","v":""},{"$f":"IF(B45<>\"\",IF(VLOOKUP(B45,Reference!$M$3:$Q$188,5,FALSE)=\" \",0,VLOOKUP(B45,Reference!$M$3:$Q$188,5,FALSE)),\"\")","v":""}]
[null,null,null,null,null,null,null,null,null,null,null,null,null,null,null,null,null,null,{"$f":"IF(B46<>\"\",IF(VLOOKUP(B46,Reference!$A$3:$B$188,2,FALSE)=\"\",\"N/A\",VLOOKUP(B46,Reference!$A$3:$B$188,2,FALSE)),\"\")","v":""},null,null,null,"",null,null,null,null,null,null,null,null,"",null,null,null,null,null,null,{"$f":"IF(B46<>\"\",IF(VLOOKUP(B46,Reference!$I$3:$J$188,2,FALSE)=\" \",0,VLOOKUP(B46,Reference!$I$3:$J$188,2,FALSE)),\"\")","v":""},{"$f":"IF(B46<>\"\",IF(VLOOKUP(B46,Reference!$M$3:$Q$188,5,FALSE)=\" \",0,VLOOKUP(B46,Reference!$M$3:$Q$188,5,FALSE)),\"\")","v":""}]
[null,null,null,null,null,null,null,null,null,null,null,null,null,null,null,null,null,null,{"$f":"IF(B47<>\"\",IF(VLOOKUP(B47,Reference!$A$3:$B$188,2,FALSE)=\"\",\"N/A\",VLOOKUP(B47,Reference!$A$3:$B$188,2,FALSE)),\"\")","v":""},null,null,null,"",null,null,null,null,null,null,null,null,"",null,null,null,null,null,null,{"$f":"IF(B47<>\"\",IF(VLOOKUP(B47,Reference!$I$3:$J$188,2,FALSE)=\" \",0,VLOOKUP(B47,Reference!$I$3:$J$188,2,FALSE)),\"\")","v":""},{"$f":"IF(B47<>\"\",IF(VLOOKUP(B47,Reference!$M$3:$Q$188,5,FALSE)=\" \",0,VLOOKUP(B47,Reference!$M$3:$Q$188,5,FALSE)),\"\")","v":""}]
[null,null,null,null,null,null,null,null,null,null,null,null,null,null,null,null,null,null,{"$f":"IF(B48<>\"\",IF(VLOOKUP(B48,Reference!$A$3:$B$188,2,FALSE)=\"\",\"N/A\",VLOOKUP(B48,Reference!$A$3:$B$188,2,FALSE)),\"\")","v":""},null,null,null,"",null,null,null,null,null,null,null,null,"",null,null,null,null,null,null,{"$f":"IF(B48<>\"\",IF(VLOOKUP(B48,Reference!$I$3:$J$188,2,FALSE)=\" \",0,VLOOKUP(B48,Reference!$I$3:$J$188,2,FALSE)),\"\")","v":""},{"$f":"IF(B48<>\"\",IF(VLOOKUP(B48,Reference!$M$3:$Q$188,5,FALSE)=\" \",0,VLOOKUP(B48,Reference!$M$3:$Q$188,5,FALSE)),\"\")","v":""}]
[null,null,null,null,null,null,null,null,null,null,null,null,null,null,null,null,null,null,{"$f":"IF(B49<>\"\",IF(VLOOKUP(B49,Reference!$A$3:$B$188,2,FALSE)=\"\",\"N/A\",VLOOKUP(B49,Reference!$A$3:$B$188,2,FALSE)),\"\")","v":""},null,null,null,"",null,null,null,null,null,null,null,null,"",null,null,null,null,null,null,{"$f":"IF(B49<>\"\",IF(VLOOKUP(B49,Reference!$I$3:$J$188,2,FALSE)=\" \",0,VLOOKUP(B49,Reference!$I$3:$J$188,2,FALSE)),\"\")","v":""},{"$f":"IF(B49<>\"\",IF(VLOOKUP(B49,Reference!$M$3:$Q$188,5,FALSE)=\" \",0,VLOOKUP(B49,Reference!$M$3:$Q$188,5,FALSE)),\"\")","v":""}]
[null,null,null,null,null,null,null,null,null,null,null,null,null,null,null,null,null,null,{"$f":"IF(B50<>\"\",IF(VLOOKUP(B50,Reference!$A$3:$B$188,2,FALSE)=\"\",\"N/A\",VLOOKUP(B50,Reference!$A$3:$B$188,2,FALSE)),\"\")","v":""},null,null,null,"",null,null,null,null,null,null,null,null,"",null,null,null,null,null,null,{"$f":"IF(B50<>\"\",IF(VLOOKUP(B50,Reference!$I$3:$J$188,2,FALSE)=\" \",0,VLOOKUP(B50,Reference!$I$3:$J$188,2,FALSE)),\"\")","v":""},{"$f":"IF(B50<>\"\",IF(VLOOKUP(B50,Reference!$M$3:$Q$188,5,FALSE)=\" \",0,VLOOKUP(B50,Reference!$M$3:$Q$188,5,FALSE)),\"\")","v":""}]
[null,null,null,null,null,null,null,null,null,null,null,null,null,null,null,null,null,null,{"$f":"IF(B51<>\"\",IF(VLOOKUP(B51,Reference!$A$3:$B$188,2,FALSE)=\"\",\"N/A\",VLOOKUP(B51,Reference!$A$3:$B$188,2,FALSE)),\"\")","v":""},null,null,null,"",null,null,null,null,null,null,null,null,"",null,null,null,null,null,null,{"$f":"IF(B51<>\"\",IF(VLOOKUP(B51,Reference!$I$3:$J$188,2,FALSE)=\" \",0,VLOOKUP(B51,Reference!$I$3:$J$188,2,FALSE)),\"\")","v":""},{"$f":"IF(B51<>\"\",IF(VLOOKUP(B51,Reference!$M$3:$Q$188,5,FALSE)=\" \",0,VLOOKUP(B51,Reference!$M$3:$Q$188,5,FALSE)),\"\")","v":""}]

{"sheet":"Reference","index":4,"n_rows":221,"n_cols":25,"rows_kept":221,"cut":false,"hidden":false,"merged":[[0,0,0,1],[1,0,1,19],[0,3,0,19]]}
["Calculate Hardness-Based Criteria Using Hardness for:",null,"Major Sewage",null,null,null,null,null,null,null,null,null,null,null,null,null,null,null,null,null,null,"Major Sewage"]
[null,null,null,null,null,null,null,null,null,null,null,null,null,null,null,null,null,null,null,null,null,"Industrial"]
["Pollutant Name","Most Stringent Criterion (µg/L)","Aquatic Life - CCC (µg/L)","Aquatic Life - CMC (µg/L)","Human Health (µg/L)","Parameter Name","Carcinogen?","Lowest Ch. 16 MDL (µg/L)","Parameter Name","Target QL (µg/L)","Target QL Method","Target QL Basis","Parameter Name","Target QL < MSC?","Target QL < Ch 16 MDL?","EPA Minimum Level (µg/L)","Conservative?","Screening Level - Low","Screening Level - High","Y",null,"Other Discharges"]
["1,1,1-Trichloroethane",{"$f":"IF(SUM(C4:E4)>0,MIN(C4:E4),\"\")","v":610},610,3000,null,"1,1,1-Trichloroethane",null,3.0000000000000002E-2,"1,1,1-Trichloroethane",0.5,"EPA 624","BOL reporting limit","1,1,1-Trichloroethane",{"$f":"IF(B4<>\"\",IF(J4<B4,\"Y\",\"\"),\"\")","v":"Y"},{"$f":"IF(J4<H4,\"Y\",\"\")","v":""},10]
["1,1,2,2-Tetrachloroethane",{"$f":"IF(SUM(C5:E5)>0,MIN(C5:E5),\"\")","v":0.17},210,1000,0.17,"1,1,2,2-Tetrachloroethane","Y",3.0000000000000002E-2,"1,1,2,2-Tetrachloroethane",0.5,"EPA 624","BOL reporting limit","1,1,2,2-Tetrachloroethane",{"$f":"IF(B5<>\"\",IF(J5<B5,\"Y\",\"\"),\"\")","v":""},{"$f":"IF(J5<H5,\"Y\",\"\")","v":""},10]
["1,1,2-Trichloroethane",0.59000000000000008,680,3400,0.59000000000000008,"1,1,2-Trichloroethane","Y",0.02,"1,1,2-Trichloroethane",0.5,"EPA 624","BOL reporting limit","1,1,2-Trichloroethane","Y","",10]
["1,1-Dichloroethane","",null,null,null,"1,1-Dichloroethane",null,null,"1,1-Dichloroethane",0.5,"EPA 624","BOL reporting limit","1,1-Dichloroethane","","",10]
["1,1-Dichloroethylene",33,1500,7500,33,"1,1-Dichloroethylene",null,0.12999999999999998,"1,1-Dichloroethylene",0.5,"EPA 624","BOL reporting limit","1,1-Dichloroethylene","Y","",10]
["1,2,3-Trichloropropane",210,null,null,210,"1,2,3-Trichloropropane",null,null,"1,2,3-Trichloropropane",0.5,"EPA 624","BOL reporting limit","1,2,3-Trichloropropane","Y",""]
["1,2,4-Trichlorobenzene",26,26,130,35,"1,2,4-Trichlorobenzene",null,0.05,"1,2,4-Trichlorobenzene",0.5,"EPA 624","BOL reporting limit","1,2,4-Trichlorobenzene","Y","",10]
["1,2,4-Trimethylbenzene",72,null,null,72,"1,2,4-Trimethylbenzene",null,null,"1,2,4-Trimethylbenzene",0.5,"EPA 624",null,"1,2,4-Trimethylbenzene","Y",""]
["1,2-Dichlorobenzene",160,160,820,420,"1,2-Dichlorobenzene",null,0.15,"1,2-Dichlorobenzene",0.5,"EPA 624","BOL reporting limit","1,2-Dichlorobenzene","Y","",10]
["1,2-Dichloroethane",0.38,3100,15000,0.38,"1,2-Dichloroethane","Y",3.0000000000000002E-2,"1,2-Dichloroethane",0.5,"EPA 624","BOL reporting limit","1,2-Dichloroethane","","",10]
["1,2-Dichloropropane",2200,2200,11000,null,"1,2-Dichloropropane",null,0.04,"1,2-Dichloropropane",0.5,"EPA 624","BOL reporting limit","1,2-Dichloropropane","Y","",10]
["1,2-Diphenylhydrazine",3.6000000000000004E-2,3,15,3.6000000000000004E-2,"1,2-Diphenylhydrazine","Y",10,"1,2-Diphenylhydrazine",10,"EPA 8270C","Reasonable reporting limit from commercial laboratory.","1,2-Diphenylhydrazine","","",20]
["1,2-cis-Dichloroethylene",12,null,null,12,"1,2-cis-Dichloroethylene",null,null,"1,2-cis-Dichloroethylene",0.5,"EPA 624",null,"1,2-cis-Dichloroethylene","Y",""]
["1,2-trans-Dichloroethylene",140,1400,6800,140,"1,2-trans-Dichloroethylene",null,0.1,"1,2-trans-Dichloroethylene",0.5,"EPA 624","BOL reporting limit","1,2-trans-Dichloroethylene","Y","",10]
["1,3,5-Trimethylbenzene",72,null,null,72,"1,3,5-Trimethylbenzene",null,null,"1,3,5-Trimethylbenzene",0.5,"EPA 624",null,"1,3,5-Trimethylbenzene","Y",""]
["1,3-Dichlorobenzene",69,69,350,420,"1,3-Dichlorobenzene",null,0.32,"1,3-Dichlorobenzene",0.5,"EPA 624","BOL reporting limit","1,3-Dichlorobenzene","Y","",10]
["1,3-Dichloropropylene",0.34,61,310,0.34,"1,3-Dichloropropylene","Y",0.2,"1,3-Dichloropropylene",0.5,"EPA 624","This parameter should be split into cis and trans isomers, then the BoL reporting limit of 0.50 can be applied to each.","1,3-Dichloropropylene","","",10]
["1,4-Dichlorobenzene",150,150,730,420,"1,4-Dichlorobenzene",null,0.24000000000000002,"1,4-Dichlorobenzene",0.5,"EPA 624","BOL reporting limit","1,4-Dichlorobenzene","Y","",10]
["1,4-Dioxane","",null,null,null,"1,4-Dioxane",null,null,"1,4-Dioxane",1,"EPA 624","BOL reporting limit","1,4-Dioxane","","",null,null,10,100]
["1-Propanol",46000,46000,230000,null,"1-Propanol",null,null,"1-Propanol",100,"EPA 8015C","Reasonable reporting limit from commercial laboratory.","1-Propanol","Y",""]
["2,3,7,8-TCDD",5.0000000000000001E-9,null,null,5.0000000000000001E-9,"2,3,7,8-TCDD","Y",2E-3,"2,3,7,8-TCDD",5.0000000000000004E-6,"EPA 1613","Reasonable reporting limit from commercial laboratory.","2,3,7,8-TCDD","","Y",1.0000000000000001E-5]
["2,4,6-Trichlorophenol",1.4,91,460,1.4,"2,4,6-Trichlorophenol","Y",0.57999999999999996,"2,4,6-Trichlorophenol",10,"EPA 625","BOL reporting limit","2,4,6-Trichlorophenol","","",10]
["2,4-Dichlorophenol",77,340,1700,77,"2,4-Dichlorophenol",null,0.39,"2,4-Dichlorophenol",10,"EPA 625","BOL reporting limit","2,4-Dichlorophenol","Y","",10]
["2,4-Dimethylphenol",130,130,660,380,"2,4-Dimethylphenol",null,0.32,"2,4-Dimethylphenol",10,"EPA 625","BOL reporting limit","2,4-Dimethylphenol","Y","",10]
["2,4-Dinitrophenol",69,130,660,69,"2,4-Dinitrophenol",null,13,"2,4-Dinitrophenol",10,"EPA 625","BOL reporting limit","2,4-Dinitrophenol","Y","Y",50]
["2,4-Dinitrotoluene",0.05,320,1600,0.05,"2,4-Dinitrotoluene","Y",0.02,"2,4-Dinitrotoluene",5,"EPA 625","BOL reporting limit","2,4-Dinitrotoluene","","",10]
["2,6-Dinitrotoluene",0.05,200,990,0.05,"2,6-Dinitrotoluene","Y",0.01,"2,6-Dinitrotoluene",5,"EPA 625","BOL reporting limit","2,6-Dinitrotoluene","","",10]
["2-Butoxyethanol",700,null,null,700,"2-Butoxyethanol",null,null,"2-Butoxyethanol",2,"EPA Method currently being researched ",null,"2-Butoxyethanol","Y",""]
["2-Chloroethyl Vinyl Ether",3500,3500,18000,null,"2-Chloroethyl Vinyl Ether",null,0.12999999999999998,"2-Chloroethyl Vinyl Ether",5,"EPA 8260B","Reasonable reporting limit from commercial laboratory.","2-Chloroethyl Vinyl Ether","Y","",10]
["2-Chloronaphthalene",1000,null,null,1000,"2-Chloronaphthalene",null,0.94,"2-Chloronaphthalene",5,"EPA 625","BOL reporting limit","2-Chloronaphthalene","Y",""]
["2-Chlorophenol",81,110,560,81,"2-Chlorophenol",null,0.31,"2-Chlorophenol",10,"EPA 625","BOL reporting limit","2-Chlorophenol","Y","",10]
["2-Hexanone",4300,4300,21000,null,"2-Hexanone",null,null,"2-Hexanone",2.5,"EPA 624","BOL reporting limit","2-Hexanone","Y",""]
["2-Nitrophenol",1600,1600,8000,null,"2-Nitrophenol",null,0.45,"2-Nitrophenol",10,"EPA 625","BOL reporting limit","2-Nitrophenol","Y","",20]
["2-Propanol",89000,89000,440000,null,"2-Propanol",null,null,"2-Propanol",0.5,"EPA 8260B","Reasonable reporting limit from commercial laboratory.","2-Propanol","Y",""]
["3,3-Dichlorobenzidine",2.0999999999999998E-2,null,null,2.0999999999999998E-2,"3,3-Dichlorobenzidine","Y",0.12999999999999998,"3,3-Dichlorobenzidine",5,"EPA 625","BOL reporting limit","3,3-Dichlorobenzidine","","",50]
["3,4-Benzofluoranthene",3.8E-3,null,null,3.8E-3,"3,4-Benzofluoranthene","Y",1.8000000000000002E-2,"3,4-Benzofluoranthene",2.5,"EPA 625","BOL reporting limit","3,4-Benzofluoranthene","",""]
["4,4-DDD",3.1E-4,1E-3,1.1000000000000001,3.1E-4,"4,4-DDD","Y",1.0999999999999999E-2,"4,4-DDD",0.05,"EPA 625","BOL reporting limit","4,4-DDD","",""]
["4,4-DDE",2.2000000000000001E-4,1E-3,1.1000000000000001,2.2000000000000001E-4,"4,4-DDE","Y",4.0000000000000001E-3,"4,4-DDE",0.05,"EPA 625","BOL reporting limit","4,4-DDE","",""]
["4,4-DDT",2.2000000000000001E-4,1E-3,1.1000000000000001,2.2000000000000001E-4,"4,4-DDT","Y",1.2E-2,"4,4-DDT",0.05,"EPA 625","BOL reporting limit","4,4-DDT","",""]
["4,6-Dinitro-o-Cresol",13,16,80,13,"4,6-Dinitro-o-Cresol",null,null,"4,6-Dinitro-o-Cresol",10,"EPA 625","BOL reporting limit","4,6-Dinitro-o-Cresol","Y",""]
["4-Bromophenyl Phenyl Ether",54,54,270,null,"4-Bromophenyl Phenyl Ether",null,1.9,"4-Bromophenyl Phenyl Ether",5,"EPA 625","BOL reporting limit","4-Bromophenyl Phenyl Ether","Y","",10]
["4-Chlorophenyl Phenyl Ether","",null,null,null,"4-Chlorophenyl Phenyl Ether",null,null,"4-Chlorophenyl Phenyl Ether",5,"EPA 625","BOL reporting limit","4-Chlorophenyl Phenyl Ether","","",10]
["4-Nitrophenol",470,470,2300,null,"4-Nitrophenol",null,0.7,"4-Nitrophenol",10,"EPA 625","BOL reporting limit","4-Nitrophenol","Y","",50]
["Acenaphthene",17,17,83,670,"Acenaphthene",null,1.8,"Acenaphthene",2.5,"EPA 625","BOL reporting limit","Acenaphthene","Y","",10]
["Acenaphthylene","",null,null,null,"Acenaphthylene",null,null,"Acenaphthylene",2.5,"EPA 625","BOL reporting limit","Acenaphthylene","","",10]
["Acetone",3500,86000,450000,3500,"Acetone",null,null,"Acetone",2.5,"EPA 624","BOL reporting limit","Acetone","Y","",50]
["Acrolein",3,3,3,6,"Acrolein",null,0.7,"Acrolein",2,"EPA 8260B","Reasonable reporting limit from commercial laboratory.","Acrolein","Y","",50]
["Acrylamide",7.0000000000000007E-2,null,null,7.0000000000000007E-2,"Acrylamide","Y",null,"Acrylamide",0.1,"ALS Environmental Method",null,"Acrylamide","",""]
["Acrylonitrile",5.0999999999999997E-2,130,650,5.0999999999999997E-2,"Acrylonitrile","Y",0.5,"Acrylonitrile",5,"EPA 8260B","Reasonable reporting limit from commercial laboratory.","Acrylonitrile","","",50]
["Aldrin",4.9000000000000005E-5,0.1,3,4.9000000000000005E-5,"Aldrin","Y",4.0000000000000001E-3,"Aldrin",0.05,"EPA 608","BOL reporting limit","Aldrin","",""]
["alpha-BHC",2.5999999999999999E-3,null,null,2.5999999999999999E-3,"alpha-BHC","Y",3.0000000000000001E-3,"alpha-BHC",0.05,"EPA 625","BOL reporting limit","alpha-BHC","",""]
["alpha-Endosulfan",5.6000000000000001E-2,5.6000000000000001E-2,0.22,62,"alpha-Endosulfan",null,1.4E-2,"alpha-Endosulfan",0.05,"EPA 608","BOL reporting limit","alpha-Endosulfan","Y",""]
["Anthracene",8300,null,null,8300,"Anthracene",null,0.66,"Anthracene",2.5,"EPA 625","BOL reporting limit","Anthracene","Y","",10]
["Benzene",1.2,130,640,1.2,"Benzene","Y",0.2,"Benzene",0.5,"EPA 624","BOL reporting limit","Benzene","Y","",10]
["Benzene Metadisulfonic Acid",1600000,1600000,2600000,null,"Benzene Metadisulfonic Acid",null,null,"Benzene Metadisulfonic Acid",null,null,null,"Benzene Metadisulfonic Acid","Y",""]
["Benzene Monosulfonic Acid",1200000,1200000,2000000,null,"Benzene Monosulfonic Acid",null,null,"Benzene Monosulfonic Acid",null,null,null,"Benzene Monosulfonic Acid","Y",""]
["Benzidine",8.6000000000000003E-5,59,300,8.6000000000000003E-5,"Benzidine","Y",44,"Benzidine",50,"EPA 625","Reasonable reporting limit from commercial laboratory.","Benzidine","","",50]
["Benzo(a)Anthracene",3.8E-3,0.1,0.5,3.8E-3,"Benzo(a)Anthracene","Y",1.2999999999999999E-2,"Benzo(a)Anthracene",2.5,"EPA 625","BOL reporting limit","Benzo(a)Anthracene","","",10]
["Benzo(a)Pyrene",3.8E-3,null,null,3.8E-3,"Benzo(a)Pyrene","Y",2.3E-2,"Benzo(a)Pyrene",2.5,"EPA 625","BOL reporting limit","Benzo(a)Pyrene","","",10]
["Benzo(ghi)Perylene","",null,null,null,"Benzo(ghi)Perylene",null,null,"Benzo(ghi)Perylene",2.5,"EPA 625","BOL reporting limit","Benzo(ghi)Perylene","","",20]
["Benzo(k)Fluoranthene",3.8E-3,null,null,3.8E-3,"Benzo(k)Fluoranthene","Y",1.7000000000000001E-2,"Benzo(k)Fluoranthene",2.5,"EPA 625","BOL reporting limit","Benzo(k)Fluoranthene","","",10]
["Benzyl Chloride",0.2,null,null,0.2,"Benzyl Chloride","Y",null,"Benzyl Chloride",0.5,"EPA 8260B",null,"Benzyl Chloride","",""]
["beta-BHC",9.0999999999999987E-3,null,null,9.0999999999999987E-3,"beta-BHC","Y",6.0000000000000001E-3,"beta-BHC",0.05,"EPA 625","BOL reporting limit","beta-BHC","",""]
["beta-Endosulfan",5.6000000000000001E-2,5.6000000000000001E-2,0.22,62,"beta-Endosulfan",null,4.0000000000000001E-3,"beta-Endosulfan",0.05,"EPA 608","BOL reporting limit","beta-Endosulfan","Y",""]
["Bis(2-Chloroethoxy)Methane","",null,null,null,"Bis(2-Chloroethoxy)Methane",null,null,"Bis(2-Chloroethoxy)Methane",5,"EPA 625","BOL reporting limit","Bis(2-Chloroethoxy)Methane","",""]
["Bis(2-Chloroethyl)Ether",{"$f":"IF(SUM(C69:E69)>0,MIN(C69:E69),\"\")","v":3.0000000000000002E-2},6000,30000,3.0000000000000002E-2,"Bis(2-Chloroethyl)Ether","Y",0.3,"Bis(2-Chloroethyl)Ether",5,"EPA 625","BOL reporting limit","Bis(2-Chloroethyl)Ether",{"$f":"IF(B69<>\"\",IF(J69<B69,\"Y\",\"\"),\"\")","v":""},{"$f":"IF(J69<H69,\"Y\",\"\")","v":""},10]
["Bis(2-Chloroisopropyl)Ether",1400,null,null,1400,"Bis(2-Chloroisopropyl)Ether",null,0.8,"Bis(2-Chloroisopropyl)Ether",5,"EPA 625","BOL reporting limit","Bis(2-Chloroisopropyl)Ether","Y","",10]
["Bis(2-Ethylhexyl)Phthalate",1.2,910,4500,1.2,"Bis(2-Ethylhexyl)Phthalate","Y",2,"Bis(2-Ethylhexyl)Phthalate",5,"EPA 625","BOL reporting limit","Bis(2-Ethylhexyl)Phthalate","","",10]
["Bromide","",null,null,null,"Bromide",null,null,"Bromide",200,"EPA 300.0","BOL reporting limit","Bromide","","",null,"Y",1000,10000]
["Bromoform",4.3,370,1800,4.3,"Bromoform","Y",0.2,"Bromoform",0.5,"EPA 624","BOL reporting limit","Bromoform","Y",""]
["Butyl Benzyl Phthalate",35,35,140,150,"Butyl Benzyl Phthalate",null,0.34,"Butyl Benzyl Phthalate",5,"EPA 625","BOL reporting limit","Butyl Benzyl Phthalate","Y","",10]
["Carbon Tetrachloride",0.23,560,2800,0.23,"Carbon Tetrachloride","Y",0.12000000000000001,"Carbon Tetrachloride",0.5,"EPA 624","BOL reporting limit","Carbon Tetrachloride","","",10]
["Chlordane",7.9999999999999993E-4,4.3E-3,2.4,7.9999999999999993E-4,"Chlordane","Y",1.4E-2,"Chlordane",1,"EPA 608","Reasonable reporting limit from commercial laboratory.","Chlordane","",""]
["Chloride",250000,null,null,250000,"Chloride",null,null,"Chloride",500,"EPA 300.0","BOL reporting limit","Chloride","Y","",null,"Y",250000,2000000]
["Chlorobenzene",130,240,1200,130,"Chlorobenzene",null,0.2,"Chlorobenzene",0.5,"EPA 624","BOL reporting limit","Chlorobenzene","Y","",10]
["Chlorodibromomethane",0.4,null,null,0.4,"Chlorodibromomethane","Y",9.0000000000000011E-2,"Chlorodibromomethane",0.5,"EPA 624","BOL reporting limit","Chlorodibromomethane","","",10]
["Chloroethane","",null,null,null,"Chloroethane",null,null,"Chloroethane",0.5,"EPA 624","BOL reporting limit","Chloroethane","","",50]
["Chloroform",5.7,390,1900,5.7,"Chloroform","Y",0.05,"Chloroform",0.5,"EPA 624","BOL reporting limit","Chloroform","Y","",10]
["Chrysene",3.8E-3,null,null,3.8E-3,"Chrysene","Y",0.15,"Chrysene",2.5,"EPA 625","BOL reporting limit","Chrysene","","",10]
["Color (Pt-Co)",75000,null,null,75000,"Color (Pt-Co)",null,null,"Color (Pt-Co)",5,"SM 2120B","BOL reporting limit","Color (Pt-Co)","Y","",null,"Y"]
["Cyclohexylamine",1000,null,null,1000,"Cyclohexylamine",null,null,"Cyclohexylamine",null,null,null,"Cyclohexylamine","Y",""]
["delta BHC","",null,null,null,"Delta BHC",null,null,"Delta BHC",0.05,"EPA 625","BOL reporting limit","Delta BHC","",""]
["Diazinon",0.17,0.17,0.17,null,"Diazinon",null,null,"Diazinon",1.5E-3,"CalTest Method \"Pyrethroids by GCMS-NCI-SIM\"","Reasonable reporting limit from commercial laboratory.","Diazinon","Y",""]
["Dibenzo(a,h)Anthrancene",3.8E-3,null,null,3.8E-3,"Dibenzo(a,h)Anthrancene","Y",3.0000000000000002E-2,"Dibenzo(a,h)Anthrancene",2.5,"EPA 625","BOL reporting limit","Dibenzo(a,h)Anthrancene","",""]
["Dibromochloromethane","",null,null,null,"Dibromochloromethane",null,null,"Dibromochloromethane",0.5,"EPA 624","BOL reporting limit","Dibromochloromethane","",""]
["Dibromomethane","",null,null,null,"Dibromomethane",null,null,"Dibromomethane",0.5,"EPA 624","BOL reporting limit","Dibromomethane","",""]
["Dichlorobromomethane",0.55000000000000004,null,null,0.55000000000000004,"Dichlorobromomethane","Y",null,"Dichlorobromomethane",0.5,"EPA 624","BOL reporting limit","Dichlorobromomethane","Y","",10]
["Dichlorodifluoromethane","",null,null,null,"Dichlorodifluoromethane",null,null,"Dichlorodifluoromethane",0.5,"EPA 624","BOL reporting limit","Dichlorodifluoromethane","",""]
["Dieldrin",5.2000000000000004E-5,5.6000000000000001E-2,0.24000000000000002,5.2000000000000004E-5,"Dieldrin",null,2E-3,"Dieldrin",0.05,"EPA 608","BOL reporting limit","Dieldrin","",""]
["Diethyl Phthalate",800,800,4000,17000,"Diethyl Phthalate",null,0.49,"Diethyl Phthalate",5,"EPA 625","BOL reporting limit","Diethyl Phthalate","Y","",10]
["Dimethyl Phthalate",500,500,2500,270000,"Dimethyl Phthalate",null,0.28999999999999998,"Dimethyl Phthalate",5,"EPA 625","BOL reporting limit","Dimethyl Phthalate","Y","",10]
["Di-n-Butyl Phthalate",21,21,110,2000,"Di-n-Butyl Phthalate",null,0.36000000000000004,"Di-n-Butyl Phthalate",5,"EPA 625","BOL reporting limit","Di-n-Butyl Phthalate","Y","",10]
["Di-n-Octyl Phthalate","",null,null,null,"Di-n-Octyl Phthalate",null,null,"Di-n-Octyl Phthalate",5,"EPA 625","BOL reporting limit","Di-n-Octyl Phthalate","","",10]
["Dissolved Iron",300,null,null,300,"Dissolved Iron",null,1,"Dissolved Iron",20,"EPA 200.7","BOL reporting limit","Dissolved Iron","Y","",null,"Y"]
["Endosulfan Sulfate","",null,null,null,"Endosulfan Sulfate",null,null,"Endosulfan Sulfate",0.05,"EPA 608","BOL reporting limit","Endosulfan Sulfate","",""]
["Endrin",3.6000000000000004E-2,3.6000000000000004E-2,8.6000000000000007E-2,5.8999999999999997E-2,"Endrin",null,6.0000000000000001E-3,"Endrin",0.05,"EPA 608","BOL reporting limit","Endrin","",""]
["Endrin Aldehyde",0.28999999999999998,null,null,0.28999999999999998,"Endrin Aldehyde",null,2.3E-2,"Endrin Aldehyde",0.05,"EPA 608","BOL reporting limit","Endrin Aldehyde","Y",""]
["Ethylbenzene",530,580,2900,530,"Ethylbenzene",null,0.2,"Ethylbenzene",0.5,"EPA 624","BOL reporting limit","Ethylbenzene","Y","",10]
["Ethylene Glycol","",null,null,null,"Ethylene Glycol",null,null,"Ethylene Glycol",1000,"EPA 8015D","BOL reporting limit","Ethylene Glycol","",""]
["Fluoranthene",40,40,200,130,"Fluoranthene",null,0.21000000000000002,"Fluoranthene",2.5,"EPA 625","BOL reporting limit","Fluoranthene","Y","",10]
["Fluorene",1100,null,null,1100,"Fluorene",null,0.21000000000000002,"Fluorene",2.5,"EPA 625","BOL reporting limit","Fluorene","Y","",10]
["Fluoride",2000,null,null,2000,"Fluoride",null,null,"Fluoride",200,"EPA 300.0","BOL reporting limit","Fluoride","Y","",null,"Y"]
["Formaldehyde",440,440,2200,700,"Formaldehyde",null,null,"Formaldehyde",21.5,"EPA 8315A","BOL reporting limit","Formaldehyde","Y",""]
["Free Available Cyanide",5.2,5.2,22,140,"Free Available Cyanide",null,1,"Free Available Cyanide",1,"BoL Method","BOL reporting limit","Free Available Cyanide","Y",""]
["gamma-BHC",9.8000000000000004E-2,null,0.95,9.8000000000000004E-2,"gamma-BHC",null,4.0000000000000001E-3,"gamma-BHC",0.05,"EPA 625","BOL reporting limit","gamma-BHC","Y",""]
["Gross Alpha (pCi/L)","",null,null,null,"Gross Alpha (pCi/L)",null,null,"Gross Alpha (pCi/L)",3,"EPA 900.0","BOL reporting limit","Gross Alpha (pCi/L)","",""]
["Heptachlor",7.9000000000000009E-5,3.8E-3,0.51999999999999991,7.9000000000000009E-5,"Heptachlor","Y",3.0000000000000001E-3,"Heptachlor",0.05,"EPA 608","BOL reporting limit","Heptachlor","",""]
["Heptachlor Epoxide",3.8999999999999999E-5,3.8E-3,0.5,3.8999999999999999E-5,"Heptachlor Epoxide","Y",8.3000000000000004E-2,"Heptachlor Epoxide",0.05,"EPA 608","BOL reporting limit","Heptachlor Epoxide","","Y"]
["Hexachlorobenzene",2.8000000000000003E-4,null,null,2.8000000000000003E-4,"Hexachlorobenzene","Y",0.05,"Hexachlorobenzene",5,"EPA 625","BOL reporting limit","Hexachlorobenzene","","",10]
["Hexachlorobutadiene",0.44,2,10,0.44,"Hexachlorobutadiene","Y",0.34,"Hexachlorobutadiene",0.5,"EPA 624","BOL reporting limit","Hexachlorobutadiene","","",10]
["Hexachlorocyclopentadiene",1,1,5,40,"Hexachlorocyclopentadiene",null,0.4,"Hexachlorocyclopentadiene",5,"EPA 625","BOL reporting limit","Hexachlorocyclopentadiene","","",10]
["Hexachloroethane",1.4,12,60,1.4,"Hexachloroethane","Y",3.0000000000000002E-2,"Hexachloroethane",5,"EPA 625","BOL reporting limit","Hexachloroethane","","",10]
["Hexavalent Chromium",10.395010395010395,{"$f":"10/0.962","v":10.395010395010395},{"$f":"16/0.982","v":16.293279022403258},null,"Hexavalent Chromium",null,7,"Hexavalent Chromium",1,"EPA 218.6","BOL reporting limit","Hexavalent Chromium","Y","Y",null,"Y"]
["Indeno(1,2,3-cd)Pyrene",3.8E-3,null,null,3.8E-3,"Indeno(1,2,3-cd)Pyrene",null,4.3000000000000003E-2,"Indeno(1,2,3-cd)Pyrene",2.5,"EPA 625","BOL reporting limit","Indeno(1,2,3-cd)Pyrene","","",20]
["Isophorone",35,2100,10000,35,"Isophorone",null,2.2000000000000002,"Isophorone",5,"EPA 625","BOL reporting limit","Isophorone","Y","",10]
["Methyl Bromide",47,110,550,47,"Methyl Bromide",null,1.1800000000000002,"Methyl Bromide",0.5,"EPA 624","BOL reporting limit","Methyl Bromide","Y","Y"]
["Methyl Chloride",5500,5500,28000,null,"Methyl Chloride",null,0.08,"Methyl Chloride",0.5,"EPA 624","BOL reporting limit","Methyl Chloride","Y",""]
["Methyl Ethyl Ketone",21000,32000,230000,21000,"Methyl Ethyl Ketone",null,null,"Methyl Ethyl Ketone",2.5,"EPA 624","BOL reporting limit","Methyl Ethyl Ketone","Y","",50]
["Methyl Isobutyl Ketone",5000,5000,26000,null,"Methyl Isobutyl Ketone",null,null,"Methyl Isobutyl Ketone",2.5,"EPA 624","BOL reporting limit","Methyl Isobutyl Ketone","Y",""]
["Methylene Chloride",4.5999999999999996,2400,12000,4.5999999999999996,"Methylene Chloride","Y",0.25,"Methylene Chloride",0.5,"EPA 624","BOL reporting limit","Methylene Chloride","Y","",10]
["Metolachlor",69,null,null,69,"Metolachlor",null,null,"Metolachlor",0.05,"EPA 608","BOL reporting limit","Metolachlor","Y",""]
["MTBE","",null,null,null,"MTBE",null,null,"MTBE",0.5,"EPA 624","BOL reporting limit","MTBE","",""]
["Naphthalene",43,43,140,null,"Naphthalene",null,1.6,"Naphthalene",0.5,"EPA 624","BOL reporting limit","Naphthalene","Y","Y",10]
["Nitrite plus Nitrate as N",10000,null,null,10000,"Nitrite plus Nitrate as N",null,null,"Nitrite plus Nitrate as N",40,"EPA 353.2","BOL reporting limit","Nitrite plus Nitrate as N","Y",""]
["Nitrobenzene",17,810,4000,17,"Nitrobenzene",null,1.9,"Nitrobenzene",5,"EPA 625","BOL reporting limit","Nitrobenzene","Y","",10]
["n-Nitrosodimethylamine",6.8999999999999997E-4,3400,17000,6.8999999999999997E-4,"N-Nitrosodimethylamine","Y",0.15,"N-Nitrosodimethylamine",5,"EPA 625","BOL reporting limit","N-Nitrosodimethylamine","",""]
["n-Nitrosodi-n-Propylamine",5.0000000000000001E-3,null,null,5.0000000000000001E-3,"N-Nitrosodi-N-Propylamine","Y",0.46,"N-Nitrosodi-N-Propylamine",5,"EPA 625","BOL reporting limit","N-Nitrosodi-N-Propylamine","","",20]
["n-Nitrosodiphenylamine",3.3,59,300,3.3,"N-Nitrosodiphenylamine","Y",0.80999999999999994,"N-Nitrosodiphenylamine",5,"EPA 625","Reasonable reporting limit from commercial laboratory.","N-Nitrosodiphenylamine","","",20]
["Nonylphenol",6.6,6.6,28,null,"Nonylphenol",null,null,"Nonylphenol",5,"USGS \"Determination of Wastewater Compounds in\nWhole Water by Continuous Liquid–Liquid Extraction\nand Capillary-Column Gas Chromatography/\nMass Spectrometry\"",null,"Nonylphenol","Y",""]
["Osmotic Pressure (mOs/kg)",50,null,50,null,"Osmotic Pressure (mOs/kg)",null,null,"Osmotic Pressure (mOs/kg)",null,"BoL Method","BOL reporting limit","Osmotic Pressure (mOs/kg)",{"$f":"IF(B133<>\"\",IF(J133<B133,\"Y\",\"\"),\"\")","v":"Y"},{"$f":"IF(J133<H133,\"Y\",\"\")","v":""},null,"Y"]
["PCB-1016",{"$f":"IF(SUM(C134:E134)>0,MIN(C134:E134),\"\")","v":""},null,null,null,"PCB-1016",null,null,"PCB-1016",0.25,"EPA 608","BOL reporting limit","PCB-1016","",""]
["PCB-1221","",null,null,null,"PCB-1221",null,30,"PCB-1221","0.25","EPA 608","BOL reporting limit","PCB-1221","",""]
["PCB-1232","",null,null,null,"PCB-1232",null,null,"PCB-1232","0.25","EPA 608","BOL reporting limit","PCB-1232","",""]
["PCB-1242","",null,null,null,"PCB-1242",null,6.5000000000000002E-2,"PCB-1242","0.25","EPA 608","BOL reporting limit","PCB-1242","",""]
["PCB-1248","",null,null,null,"PCB-1248",null,null,"PCB-1248","0.25","EPA 608","BOL reporting limit","PCB-1248","",""]
["PCB-1254","",null,null,null,"PCB-1254",null,null,"PCB-1254","0.25","EPA 608","BOL reporting limit","PCB-1254","",""]
["PCB-1260","",null,null,null,"PCB-1260",null,null,"PCB-1260","0.25","EPA 608","BOL reporting limit","PCB-1260","",""]
["PCBs, Total",6.4000000000000011E-5,1.4E-2,null,6.4000000000000011E-5,"PCBs, Total","Y",null,"PCBs, Total",1.75,"EPA 608","The RL should at least be the combination of the other RLs involved.","PCBs, Total","",""]
["p-Chloro-m-Cresol",30,30,160,null,"p-Chloro-m-Cresol",null,0.36000000000000004,"p-Chloro-m-Cresol",10,"EPA 625","BOL reporting limit","p-Chloro-m-Cresol","Y",""]
["p-Cresol",160,160,800,null,"p-Cresol",null,null,"p-Cresol",20,"EPA 625","BOL reporting limit","p-Cresol","Y","",20]
["p-Phenol Sulfonic Acid",1400000,1400000,3500000,null,"p-Phenol Sulfonic Acid",null,null,"p-Phenol Sulfonic Acid",null,null,null,"p-Phenol Sulfonic Acid","Y",""]
["Pentachlorophenol",{"$f":"IF(SUM(C145:E145)>0,ROUND(MIN(C145:E145),5),\"\")","v":0.27},{"$f":"EXP(1.005*(A221)-5.134)","v":6.6925836807833567},{"$f":"EXP(1.005*(A221)-4.869)","v":8.7233208775218429},0.27,"Pentachlorophenol","Y",0.59000000000000008,"Pentachlorophenol",10,"EPA 625","BOL reporting limit","Pentachlorophenol","","",50]
["Phenanthrene",1,1,5,null,"Phenanthrene",null,0.64,"Phenanthrene",2.5,"EPA 625","BOL reporting limit","Phenanthrene","","",10]
["Phenol",10400,null,null,10400,"Phenol",null,0.13999999999999999,"Phenol",10,"EPA 625","BOL reporting limit","Phenol","Y","",10]
["Pyrene",830,null,null,830,"Pyrene",null,0.27,"Pyrene",2.5,"EPA 625","BOL reporting limit","Pyrene","Y","",10]
["Radium 226/228 (pCi/L)","",null,null,null,"Radium 226/228 (pCi/L)",null,null,"Radium 226/228 (pCi/L)",1,"EPA 903.1","BOL reporting limit","Radium 226/228 (pCi/L)","",""]
["Resorcinol",2700,7200,28000,2700,"Resorcinol",null,null,"Resorcinol",null,null,null,"Resorcinol","Y",""]
["Sulfate",250000,null,null,250000,"Sulfate",null,null,"Sulfate",1000,"EPA 300.0","BOL reporting limit","Sulfate","Y","",null,"Y",250000,2000000]
["Tetrachloroethylene",0.69,140,700,0.69,"Tetrachloroethylene","Y",3.0000000000000002E-2,"Tetrachloroethylene",0.5,"EPA 624","BOL reporting limit","Tetrachloroethylene","Y","",10]
["Toluene",330,330,1700,1300,"Toluene",null,0.2,"Toluene",0.5,"EPA 624","BOL reporting limit","Toluene","Y","",10]
["Total Aluminum",750,null,750,null,"Total Aluminum",null,1,"Total Aluminum",10,"EPA 200.8","BOL reporting limit","Total Aluminum","Y","",null,"Y"]
["Total Antimony",5.6,220,1100,5.6,"Total Antimony",null,0.4,"Total Antimony",2,"EPA 200.8","BOL reporting limit","Total Antimony","Y","",null,"Y"]
["Total Arsenic",10,150,340,10,"Total Arsenic",null,0.5,"Total Arsenic",3,"EPA 200.8","BOL reporting limit","Total Arsenic","Y","",null,"Y"]
["Total Barium",2400,4100,21000,2400,"Total Barium",null,1,"Total Barium",2,"EPA 200.8","BOL reporting limit","Total Barium","Y","",null,"Y"]
["Total Beryllium","",null,null,null,"Total Beryllium",null,null,"Total Beryllium",1,"EPA 200.7","BOL reporting limit","Total Beryllium","","",null,"Y"]
["Total Beta (pCi/L)","",null,null,null,"Total Beta (pCi/L)",null,null,"Total Beta (pCi/L)",4,"EPA 900.0","BOL reporting limit","Total Beta (pCi/L)","",""]
["Total Boron",1600,1600,8100,3100,"Total Boron",null,0.2,"Total Boron",200,"EPA 200.7","BOL reporting limit","Total Boron","Y","",null,"Y"]
["Total Cadmium",{"$f":"IF(SUM(C161:E161)>0,ROUND(MIN(C161:E161),3),\"\")","v":0.27100000000000002},{"$f":"EXP(0.7409*LN(A220)-4.719)","v":0.27062277304252191},{"$f":"EXP(1.0166*LN(A220)-3.924)","v":2.1331846651868007},null,"Total Cadmium",null,0.05,"Total Cadmium",0.2,"EPA 200.8","BOL reporting limit","Total Cadmium","Y","",null,"Y"]
["Total Chromium","",null,null,null,"Total Chromium",null,null,"Total Chromium",4,"EPA 200.8","BOL reporting limit","Total Chromium","","",null,"Y"]
["Total Chromium (III)",{"$f":"IF(SUM(C163:E163)>0,ROUND(MIN(C163:E163),1),\"\")","v":86.2},{"$f":"EXP(0.819*LN(A220)+0.6848)","v":86.179676837374203},{"$f":"EXP(0.819*LN(A220)+3.7256)","v":1803.0489685600057},null,"Total Chromium (III)",null,0.1,"Total Chromium (III)",4,"EPA 200.8","The RL should at least be the combination of the other RLs involved.","Total Chromium (III)","Y","",null,"Y"]
["Total Cobalt",19,19,95,null,"Total Cobalt",null,9.0000000000000011E-2,"Total Cobalt",1,"EPA 200.8","BOL reporting limit","Total Cobalt","Y","",null,"Y"]
["Total Copper",{"$f":"IF(SUM(C165:E165)>0,ROUND(MIN(C165:E165),2),\"\")","v":9.33},{"$f":"EXP(0.8545*LN(A220)-1.702)","v":9.3289076055564397},{"$f":"EXP(0.9422*LN(A220)-1.7)","v":13.999076305191297},null,"Total Copper",null,0.5,"Total Copper",4,"EPA 200.8","BOL reporting limit","Total Copper","Y","",null,"Y"]
["Total Cyanide","",null,null,null,"Total Cyanide",null,null,"Total Cyanide",10,"EPA 335.4","BOL reporting limit","Total Cyanide","",""]
["Total Dissolved Solids",500000,null,null,500000,"Total Dissolved Solids",null,null,"Total Dissolved Solids",2000,"USGS-I-1749","BOL reporting limit","Total Dissolved Solids","Y","",null,"Y",1000000,5000000]
["Total Iron",1500,1500,null,null,"Total Iron",null,1,"Total Iron",20,"EPA 200.7","BOL reporting limit","Total Iron","Y","",null,"Y"]
["Total Lead",{"$f":"IF(SUM(C169:E169)>0,ROUND(MIN(C169:E169),2),\"\")","v":3.18},{"$f":"EXP(1.273*LN(A220)-4.705)","v":3.1815918291892142},{"$f":"EXP(1.273*LN(A220)-1.46)","v":81.645087050644918},null,"Total Lead",null,0.6,"Total Lead",1,"EPA 200.8","BOL reporting limit","Total Lead","Y","",null,"Y"]
["Total Manganese",1000,null,null,1000,"Total Manganese",null,0.1,"Total Manganese",2,"EPA 200.8","BOL reporting limit","Total Manganese","Y","",null,"Y"]
["Total Mercury",0.05,{"$f":"0.77/0.85","v":0.90588235294117647},{"$f":"1.4/0.85","v":1.6470588235294117},0.05,"Total Mercury",null,1.9999999999999998E-4,"Total Mercury",0.2,"EPA 245.1","BOL reporting limit","Total Mercury","","",null,"Y"]
["Total Molybdenum","",null,null,null,"Total Molybdenum",null,null,"Total Molybdenum",4,"EPA 200.8","BOL reporting limit","Total Molybdenum","","",null,"Y",500,5000]
["Total Nickel",{"$f":"IF(SUM(C173:E173)>0,ROUND(MIN(C173:E173),1),\"\")","v":52.2},{"$f":"EXP(0.846*LN(A220)+0.0584)","v":52.163028483303464},{"$f":"EXP(0.846*LN(A220)+2.255)","v":469.17412929110583},610,"Total Nickel",null,0.5,"Total Nickel",4,"EPA 200.8","BOL reporting limit","Total Nickel","Y","",null,"Y"]
["Total Phenols (Phenolics)",5,null,null,5,"Total Phenols (Phenolics)",null,2,"Total Phenols (Phenolics)",5,"EPA 420.4","BOL reporting limit","Total Phenols (Phenolics)","",""]
["Total Residual Chlorine",1.0999999999999999E-2,1.0999999999999999E-2,1.9E-2,null,"Total Residual Chlorine",null,null,"Total Residual Chlorine",20,"Reaserch from accredited labs from 2011.  See document TRC MDL for NPDES Permits (May 2011)","BOL reporting limit","Total Residual Chlorine","",""]
["Total Selenium",4.9891540130151837,{"$f":"4.6/0.922","v":4.9891540130151837},null,null,"Total Selenium",null,0.6,"Total Selenium",5,"EPA 200.8","BOL reporting limit","Total Selenium","","",null,"Y"]
["Total Silver",{"$f":"IF(SUM(C177:E177)>0,ROUND(MIN(C177:E177),2),\"\")","v":3.78},null,{"$f":"EXP(1.72*LN(A220)-6.59)","v":3.7844203073392748},null,"Total Silver",null,0.1,"Total Silver",0.4,"EPA 200.8","BOL reporting limit","Total Silver","Y","",null,"Y"]
["Total Strontium",4000,null,null,4000,"Total Strontium",null,null,"Total Strontium",10,"EPA 200.7","BOL reporting limit","Total Strontium","Y","",null,"Y"]
["Total Thallium",0.24000000000000002,13,65,0.24000000000000002,"Total Thallium",null,0.3,"Total Thallium",2,"EPA 200.8","BOL reporting limit","Total Thallium","","",null,"Y"]
["Total Tungsten","",null,null,null,"Total Tungsten",null,null,"Total Tungsten",1000,"EPA 200.7","BOL reporting limit","Total Tungsten","","",null,"Y"]
["Total Uranium","",null,null,null,"Total Uranium",null,null,"Total Uranium",2,"This number is by Total Uranium Analysis via a UA-3 Uranium analizer, but that may be obsolete now.  I have a call into the Radiation Measurements to see if they have a different method they are using now.  If anything, I think our QL could be lowered.","BOL reporting limit","Total Uranium","","",null,"Y"]
["Total Vanadium",100,100,510,null,"Total Vanadium",null,null,"Total Vanadium",13,"EPA 200.8","BOL reporting limit","Total Vanadium","Y","",null,"Y"]
["Total Xylenes",210,210,1100,70000,"Total Xylenes",null,null,"Total Xylenes",1.5,"EPA 624","The RL should at least be the combination of the other RLs involved.","Total Xylenes","Y",""]
["Total Zinc",{"$f":"IF(SUM(C184:E184)>0,ROUND(MIN(C184:E184),1),\"\")","v":119.8},{"$f":"EXP(0.8473*LN(A220)+0.884)","v":119.81641527070842},{"$f":"EXP(0.8473*LN(A220)+0.884)","v":119.81641527070842},null,"Total Zinc",null,0.05,"Total Zinc",5,"EPA 200.8","BOL reporting limit","Total Zinc","Y","",null,"Y"]
["Toxaphene",1.9999999999999998E-4,1.9999999999999998E-4,0.73,2.8000000000000003E-4,"Toxaphene","Y",0.24000000000000002,"Toxaphene",0.5,"EPA 608","BOL reporting limit","Toxaphene","",""]
["Trichloroethylene",2.5,450,2300,2.5,"Trichloroethylene","Y",0.12000000000000001,"Trichloroethylene",0.5,"EPA 624","BOL reporting limit","Trichloroethylene","Y","",10]
["Trichlorofluoromethane","",null,null,null,"Trichlorofluoromethane",null,null,"Trichlorofluoromethane",0.5,"EPA 624","BOL reporting limit","Trichlorofluoromethane","",""]
["Vinyl Chloride",2.5000000000000001E-2,null,null,2.5000000000000001E-2,"Vinyl Chloride","Y",0.18000000000000002,"Vinyl Chloride",0.5,"EPA 624","BOL reporting limit","Vinyl Chloride","","",10]
["Other (TYPE HERE)","",null,null,null,{"$f":"A189","v":"Other (TYPE HERE)"},null,null,{"$f":"A189","v":"Other (TYPE HERE)"},null,null,null,{"$f":"A189","v":"Other (TYPE HERE)"}]
["Other (TYPE HERE)","",null,null,null,{"$f":"A190","v":"Other (TYPE HERE)"},null,null,{"$f":"A190","v":"Other (TYPE HERE)"},null,null,null,{"$f":"A190","v":"Other (TYPE HERE)"}]
["Other (TYPE HERE)","",null,null,null,{"$f":"A191","v":"Other (TYPE HERE)"},null,null,{"$f":"A191","v":"Other (TYPE HERE)"},null,null,null,{"$f":"A191","v":"Other (TYPE HERE)"}]
["Other (TYPE HERE)","",null,null,null,"Other (TYPE HERE)",null,null,"Other (TYPE HERE)",null,null,null,"Other (TYPE HERE)"]
["Other (TYPE HERE)","",null,null,null,"Other (TYPE HERE)",null,null,"Other (TYPE HERE)",null,null,null,"Other (TYPE HERE)"]
["Other (TYPE HERE)","",null,null,null,"Other (TYPE HERE)",null,null,"Other (TYPE HERE)",null,null,null,"Other (TYPE HERE)"]
["Other (TYPE HERE)","",null,null,null,"Other (TYPE HERE)",null,null,"Other (TYPE HERE)",null,null,null,"Other (TYPE HERE)"]
["Other (TYPE HERE)","",null,null,null,"Other (TYPE HERE)",null,null,"Other (TYPE HERE)",null,null,null,"Other (TYPE HERE)"]
["Other (TYPE HERE)",{"$f":"IF(SUM(C197:E197)>0,MIN(C197:E197),\"\")","v":""},null,null,null,"Other (TYPE HERE)",null,null,"Other (TYPE HERE)",null,null,null,"Other (TYPE HERE)"]
["Other (TYPE HERE)","",null,null,null,"Other (TYPE HERE)",null,null,"Other (TYPE HERE)",null,null,null,"Other (TYPE HERE)"]
["Other (TYPE HERE)","",null,null,null,"Other (TYPE HERE)",null,null,"Other (TYPE HERE)",null,null,null,"Other (TYPE HERE)"]
["Other (TYPE HERE)","",null,null,null,"Other (TYPE HERE)",null,null,"Other (TYPE HERE)",null,null,null,"Other (TYPE HERE)"]
["Other (TYPE HERE)","",null,null,null,"Other (TYPE HERE)",null,null,"Other (TYPE HERE)",null,null,null,"Other (TYPE HERE)"]
["Other (TYPE HERE)","",null,null,null,"Other (TYPE HERE)",null,null,"Other (TYPE HERE)",null,null,null,"Other (TYPE HERE)"]
["Other (TYPE HERE)","",null,null,null,"Other (TYPE HERE)",null,null,"Other (TYPE HERE)",null,null,null,"Other (TYPE HERE)"]
["Other (TYPE HERE)","",null,null,null,"Other (TYPE HERE)",null,null,"Other (TYPE HERE)",null,null,null,"Other (TYPE HERE)"]
["Other (TYPE HERE)","",null,null,null,"Other (TYPE HERE)",null,null,"Other (TYPE HERE)",null,null,null,"Other (TYPE HERE)"]
["Other (TYPE HERE)","",null,null,null,"Other (TYPE HERE)",null,null,"Other (TYPE HERE)",null,null,null,"Other (TYPE HERE)"]
["Other (TYPE HERE)","",null,null,null,"Other (TYPE HERE)",null,null,"Other (TYPE HERE)",null,null,null,"Other (TYPE HERE)"]
["Other (TYPE HERE)","",null,null,null,"Other (TYPE HERE)",null,null,"Other (TYPE HERE)",null,null,null,"Other (TYPE HERE)"]
["Other (TYPE HERE)","",null,null,null,"Other (TYPE HERE)",null,null,"Other (TYPE HERE)",null,null,null,"Other (TYPE HERE)"]
["Other (TYPE HERE)","",null,null,null,"Other (TYPE HERE)",null,null,"Other (TYPE HERE)",null,null,null,"Other (TYPE HERE)",null,null,null,null,null,null,null,null,null,null,null," "]
["Other (TYPE HERE)","",null,null,null,"Other (TYPE HERE)",null,null,"Other (TYPE HERE)",null,null,null,"Other (TYPE HERE)"]
["Other (TYPE HERE)","",null,null,null,"Other (TYPE HERE)",null,null,"Other (TYPE HERE)",null,null,null,"Other (TYPE HERE)"]
["Other (TYPE HERE)","",null,null,null,"Other (TYPE HERE)",null,null,"Other (TYPE HERE)",null,null,null,"Other (TYPE HERE)"]
["Other (TYPE HERE)","",null,null,null,"Other (TYPE HERE)",null,null,"Other (TYPE HERE)",null,null,null,"Other (TYPE HERE)"]
["Other (TYPE HERE)","",null,null,null,"Other (TYPE HERE)",null,null,"Other (TYPE HERE)",null,null,null,"Other (TYPE HERE)"]
["Other (TYPE HERE)","",null,null,null,"Other (TYPE HERE)",null,null,"Other (TYPE HERE)",null,null,null,"Other (TYPE HERE)"]
["Other (TYPE HERE)","",null,null,null,"Other (TYPE HERE)",null,null,"Other (TYPE HERE)",null,null,null,"Other (TYPE HERE)"]
["Other (TYPE HERE)","",null,null,null,"Other (TYPE HERE)",null,null,"Other (TYPE HERE)",null,null,null,"Other (TYPE HERE)"]
[null,null,null,null,null,null,null,null,null,null,null,null,null,{"$f":"COUNTIF(N4:N188,\"Y\")","v":100},{"$f":"COUNTIF(O4:O188,\"Y\")","v":6}]
[{"$f":"IF(C1=\"Major Sewage\",'Major Sewage'!J7,IF(C1=\"Industrial\",Industrial!J7,IF(C1=\"Other Discharges\",'Other Discharges'!I7)))","v":100},"Analysis Hardness to Use"]
[{"$f":"IF(C1=\"Major Sewage\",'Major Sewage'!AJ7,IF(C1=\"Industrial\",Industrial!AJ7,IF(C1=\"Other Discharges\",'Other Discharges'!AI7)))","v":7},"Analysis pH to Use"]