{"text_format":"1","workbook":"xlsx","n_sheets":9,"sheets":["Unit Conversion","Lookup","SigFigures","Treatment Efficiency","F-M Ratio","Sludge Generation","Alkalinity - Nitrification","Flow Concentration & Loading","Geometric Mean"],"not_rendered":{"charts":0,"images":1,"macros":1,"external_links":2,"defined_names":42,"comments":0,"pivot_tables":0},"unopened":[],"bounds":{"document_bytes":16777216,"sheet_cells":100000,"rows_first":2000,"rows_last":500,"rows_between":2000,"halvings":0,"cell_chars":16384,"cell_head_chars":4096},"cells_cut":0,"cells_raw":0,"read":"whole","date_system":"1900"}

{"sheet":"Unit Conversion","index":0,"n_rows":24,"n_cols":11,"rows_kept":24,"cut":false,"hidden":false,"merged":[[3,1,3,2]]}
[null,null,null,null,null,null,null,null,null,null,"Click Here to Select Type of Conversion"]
[null,"Unit Conversions",null,null,null,null,null,null,null,null,"Area"]
[null,null,null,null,null,null,null,null,null,null,"Flow"]
[null,"Click Here to Select Type of Conversion",null,null,null,null,null,null,null,null,"Length"]
[null,"Enter Value","Select Unit of Measurement 1","Converts To","Result","Select Unit of Measurement 2",null,"Area Lookup","Result",null,"Mass"]
[null,null,null,{"$f":"IF(AND(B6<>\"\",C6<>\"\"),\"=\",\"\")","v":""},{"$f":"IFERROR(IF(AND(D6<>\"\",F6<>\"\"),IF(ROUND(I24,SigFigures!C24)=0,I24,ROUND(I24,SigFigures!C24)),\"\"),\"\")","v":""},null,null,{"$f":"IFERROR(INDEX(Lookup!$A$2:$A$82,SMALL(IF((Lookup!$B$2:$B$82=C6)*(Lookup!$C$2:$C$82=F6),ROW($2:$82)-ROW($1:$1)),ROW($A1))),\"\")","v":""},{"$f":"IF(AND(D6<>\"\",F6<>\"\",B4=\"Area\"),B6*H6,\"\")","v":""},null,"Power"]
[null,null,null,null,null,null,null,"Volume Lookup","Result",null,"Pressure"]
[null,null,null,null,null,null,null,{"$f":"IFERROR(INDEX(Lookup!$E$2:$E$145,SMALL(IF((Lookup!$F$2:$F$145=C6)*(Lookup!$G$2:$G$145=F6),ROW($2:$145)-ROW($1:$1)),ROW($A1))),\"\")","v":""},{"$f":"IF(AND($D$6<>\"\",$F$6<>\"\",$B$4=\"Volume\"),$B$6*H8,\"\")","v":""},null,"Temperature"]
[null,null,null,null,null,null,null,"Flow Lookup","Result",null,"Time"]
[null,null,null,null,null,null,null,{"$f":"IFERROR(INDEX(Lookup!$I$2:$I$101,SMALL(IF((Lookup!$J$2:$J$101=C6)*(Lookup!$K$2:$K$101=F6),ROW($2:$101)-ROW($1:$1)),ROW($A1))),\"\")","v":""},{"$f":"IF(AND($D$6<>\"\",$F$6<>\"\",$B$4=\"Flow\"),$B$6*H10,\"\")","v":""},null,"Volume"]
[null,null,null,null,null,null,null,"Length Lookup","Result"]
[null,null,null,null,null,null,null,{"$f":"IFERROR(INDEX(Lookup!$M$2:$M$82,SMALL(IF((Lookup!$N$2:$N$82=C6)*(Lookup!$O$2:$O$82=F6),ROW($2:$82)-ROW($1:$1)),ROW($A1))),\"\")","v":""},{"$f":"IF(AND($D$6<>\"\",$F$6<>\"\",$B$4=\"Length\"),$B$6*H12,\"\")","v":""}]
[null,null,null,null,null,null,null,"Power Lookup","Result"]
[null,null,null,null,null,null,null,{"$f":"IFERROR(INDEX(Lookup!$W$2:$W$65,SMALL(IF((Lookup!$X$2:$X$65=C6)*(Lookup!$Y$2:$Y$65=F6),ROW($2:$65)-ROW($1:$1)),ROW($A1))),\"\")","v":""},{"$f":"IF(AND($D$6<>\"\",$F$6<>\"\",$B$4=\"Power\"),$B$6*H14,\"\")","v":""}]
[null,null,null,null,null,null,null,"Pressure Lookup","Result"]
{"$rows_left_out":10}
{"sheet":"Lookup","index":1,"n_rows":145,"n_cols":33,"rows_kept":145,"cut":false,"hidden":true,"merged":[]}
["Value","Area_1","Area_2",null,"Value","Volume_1","Volume_2",null,"Value","Flow_1","Flow_2",null,"Value","Length_1","Length_2",null,"Temp",null,"Value","Time_1","Time_2",null,"Value","Power_1","Power_2",null,"Value","Pressure_1","Pressure_2",null,"Value","Weight_1","Weight_2"]
[1,"Acres","Acres",null,1,"Gallons","Gallons",null,1,"Gallons/Day","Gallons/Day",null,1,"Miles","Miles",null,"Degrees Fahrenheit",null,1,"Milliseconds","Milliseconds",null,1,"BTU/Minute","BTU/Minute",null,1,"Atmospheres","Atmospheres",null,1,"Grams","Grams"]
[0.40468700000000002,"Acres","Hectares",null,3.0689E-6,"Gallons","Acre-Feet",null,6.9444000000000005E-4,"Gallons/Day","Gallons/Minute",null,5280,"Miles","Feet",null,"Degrees Celsius",null,1E-3,"Milliseconds","Seconds",null,60,"BTU/Minute","BTU/Hour",null,1.01325,"Atmospheres","Bars",null,1000,"Grams","Milligrams"]
[40468700,"Acres","Square Centimeters",null,3785.4,"Gallons","Cubic Centimeters",null,1.15741E-5,"Gallons/Day","Gallons/Second",null,160934,"Miles","Centimeters",null,"Degrees Kelvin",null,1.666E-5,"Milliseconds","Minutes",null,778.17,"BTU/Minute","Foot-Pound/Minute",null,29.920999999999999,"Atmospheres","Inches Hg at 32 Degrees F",null,1E-3,"Grams","Kilograms"]
[43560,"Acres","Square Feet",null,0.13367999999999999,"Gallons","Cubic Feet",null,9.9999999999999995E-7,"Gallons/Day","Million Gallons/Day",null,1609340,"Miles","Millimeters",null,"Degrees Rankine",null,2.7776999999999998E-7,"Milliseconds","Hours",null,12.9696,"BTU/Minute","Foot-Pound/Second",null,760,"Atmospheres","Millimeters Hg at 0 Degrees C",null,15.432,"Grams","Grains"]
[6272660,"Acres","Square Inches",null,231,"Gallons","Cubic Inches",null,0.13367200000000001,"Gallons/Day","Cubic Feet/Day",null,1.60934,"Miles","Kilometers",null,null,null,1.1574E-8,"Milliseconds","Days",null,2.3574999999999999E-2,"BTU/Minute","Horsepower",null,101325,"Atmospheres","Pascals",null,3.5274E-2,"Grams","Ounces"]
[4.0468700000000002E-3,"Acres","Square Kilometers",null,3.7854E-3,"Gallons","Cubic Meters",null,9.2830000000000004E-5,"Gallons/Day","Cubic Feet/Minute",null,1609.34,"Miles","Meters",null,null,null,1.6534000000000001E-9,"Milliseconds","Weeks",null,17.576000000000001,"BTU/Minute","Watts",null,14.696,"Atmospheres","Pounds/Square Inch",null,2.2046000000000001E-3,"Grams","Pounds"]
[4046.87,"Acres","Square Meters",null,4.9509999999999997E-3,"Gallons","Cubic Yards",null,1.54713E-6,"Gallons/Day","Cubic Feet/Second",null,63360,"Miles","Inches",null,null,null,3.9193999999999999E-10,"Milliseconds","Months",null,1.7576000000000001E-2,"BTU/Minute","Kilowatts",null,760,"Atmospheres","Torrs",null,1.1023E-6,"Grams","Tons"]
[1.5625000000000001E-3,"Acres","Square Miles",null,3.7854000000000001,"Gallons","Liters",null,3.7854000000000001,"Gallons/Day","Liters/Day",null,1760,"Miles","Yards",null,null,null,4.5899999999999996E-12,"Milliseconds","Years",null,1.7575999999999999E-5,"BTU/Minute","Megawatts",null,0.98692299999999999,"Bars","Atmospheres",null,9.9999999999999995E-7,"Grams","Metric Tons"]
[4840,"Acres","Square Yards",null,3785.4,"Gallons","Milliliters",null,2.6289999999999998E-3,"Gallons/Day","Liters/Minute",null,8,"Miles","Furlongs",null,null,null,1000,"Seconds","Milliseconds",null,1.6666E-2,"BTU/Hour","BTU/Minute",null,1,"Bars","Bars",null,1E-3,"Milligrams","Grams"]
[2.4710399999999999,"Hectares","Acres",null,128,"Gallons","Ounces",null,4.3812500000000001E-5,"Gallons/Day","Liters/Second",null,1.894E-4,"Feet","Miles",null,null,null,1,"Seconds","Seconds",null,1,"BTU/Hour","BTU/Hour",null,29.53,"Bars","Inches Hg at 32 Degrees F",null,1,"Milligrams","Milligrams"]
[1,"Hectares","Hectares",null,8,"Gallons","Pints",null,1440,"Gallons/Minute","Gallons/Day",null,1,"Feet","Feet",null,null,null,1.66666E-2,"Seconds","Minutes",null,12.9696,"BTU/Hour","Foot-Pound/Minute",null,750,"Bars","Millimeters Hg at 0 Degrees C",null,9.9999999999999995E-7,"Milligrams","Kilograms"]
[100000000,"Hectares","Square Centimeters",null,4,"Gallons","Quarts",null,1,"Gallons/Minute","Gallons/Minute",null,30.48,"Feet","Centimeters",null,null,null,2.7769999999999997E-4,"Seconds","Hours",null,0.21615999999999999,"BTU/Hour","Foot-Pound/Second",null,100000,"Bars","Pascals",null,1.5432E-2,"Milligrams","Grains"]
[107639,"Hectares","Square Feet",null,352851,"Acre-Feet","Gallons",null,1.66666E-2,"Gallons/Minute","Gallons/Second",null,304.8,"Feet","Millimeters",null,null,null,1.1574E-5,"Seconds","Days",null,3.9290000000000001E-4,"BTU/Hour","Horsepower",null,14.504,"Bars","Pounds/Square Inch",null,3.5274000000000001E-5,"Milligrams","Ounces"]
[15499993.800000001,"Hectares","Square Inches",null,1,"Acre-Feet","Acre-Feet",null,1.4400000000000001E-3,"Gallons/Minute","Million Gallons/Day",null,3.0479999999999998E-4,"Feet","Kilometers",null,null,null,1.6533999999999999E-6,"Seconds","Weeks",null,0.29310000000000003,"BTU/Hour","Watts",null,750,"Bars","Torrs",null,2.2046E-6,"Milligrams","Pounds"]
{"$rows_left_out":131}
{"sheet":"SigFigures","index":2,"n_rows":34,"n_cols":4,"rows_kept":34,"cut":false,"hidden":true,"merged":[]}
["Significant Figures"]
[]
["Value",{"$f":"'Unit Conversion'!I24","v":false}]
["Decimal",{"$f":"IF(ISERR(FIND(\".\",B3)),\"No\",\"Yes\")","v":"No"}]
[]
["1st Digit Zero?",{"$f":"IF(LEFT(B3,1)=\"0\",\"Yes\",\"\")","v":""}]
["Last Digit Zero?",{"$f":"IF(RIGHT(B3,1)=\"0\",\"Yes\",\"\")","v":""}]
[]
[null,"Value","Non-Zero SFs","Zero SFs"]
["Digit 1",{"$f":"IF(AND(LEFT(B3,1)<>\"\",LEFT(B3,1)<>\".\"),VALUE(LEFT(B3,1)),LEFT(B3,1))","v":{"$error":"#VALUE!"}},{"$f":"IF(B10<>\"\",IF(AND(B10<>0,B10<>\".\"),\"Yes\",\"No\"),\"\")","v":{"$error":"#VALUE!"}},{"$f":"IF(AND(B10<>\"\",B10<>\".\",C10=\"No\"),IF(AND(SUM($B9:B$10)>0,OR(SUM(B11:$B$22)>0,$B$4=\"Yes\")),\"Yes\",\"No\"),\"\")","v":{"$error":"#VALUE!"}}]
["Digit 2",{"$f":"IF(AND(MID(B3,2,1)<>\"\",MID(B3,2,1)<>\".\"),VALUE(MID(B3,2,1)),MID(B3,2,1))","v":{"$error":"#VALUE!"}},{"$error":"#VALUE!"},{"$f":"IF(AND(B11<>\"\",B11<>\".\",C11=\"No\"),IF(AND(SUM($B$10:B10)>0,OR(SUM(B12:$B$22)>0,$B$4=\"Yes\")),\"Yes\",\"No\"),\"\")","v":{"$error":"#VALUE!"}}]
["Digit 3",{"$f":"IF(AND(MID(B3,3,1)<>\"\",MID(B3,3,1)<>\".\"),VALUE(MID(B3,3,1)),MID(B3,3,1))","v":{"$error":"#VALUE!"}},{"$error":"#VALUE!"},{"$f":"IF(AND(B12<>\"\",B12<>\".\",C12=\"No\"),IF(AND(SUM($B$10:B11)>0,OR(SUM(B13:$B$22)>0,$B$4=\"Yes\")),\"Yes\",\"No\"),\"\")","v":{"$error":"#VALUE!"}}]
["Digit 4",{"$f":"IF(AND(MID(B3,4,1)<>\"\",MID(B3,4,1)<>\".\"),VALUE(MID(B3,4,1)),MID(B3,4,1))","v":{"$error":"#VALUE!"}},{"$error":"#VALUE!"},{"$f":"IF(AND(B13<>\"\",B13<>\".\",C13=\"No\"),IF(AND(SUM($B$10:B12)>0,OR(SUM(B14:$B$22)>0,$B$4=\"Yes\")),\"Yes\",\"No\"),\"\")","v":{"$error":"#VALUE!"}}]
["Digit 5",{"$f":"IF(AND(MID(B3,5,1)<>\"\",MID(B3,5,1)<>\".\"),VALUE(MID(B3,5,1)),MID(B3,5,1))","v":{"$error":"#VALUE!"}},{"$error":"#VALUE!"},{"$f":"IF(AND(B14<>\"\",B14<>\".\",C14=\"No\"),IF(AND(SUM($B$10:B13)>0,OR(SUM(B15:$B$22)>0,$B$4=\"Yes\")),\"Yes\",\"No\"),\"\")","v":{"$error":"#VALUE!"}}]
["Digit 6",{"$f":"IF(AND(MID(B3,6,1)<>\"\",MID(B3,6,1)<>\".\"),VALUE(MID(B3,6,1)),MID(B3,6,1))","v":""},"",{"$f":"IF(AND(B15<>\"\",B15<>\".\",C15=\"No\"),IF(AND(SUM($B$10:B14)>0,OR(SUM(B16:$B$22)>0,$B$4=\"Yes\")),\"Yes\",\"No\"),\"\")","v":""}]
{"$rows_left_out":20}
{"sheet":"Treatment Efficiency","index":3,"n_rows":6,"n_cols":8,"rows_kept":6,"cut":false,"hidden":false,"merged":[[3,1,3,7]]}
[]
[null,"Treatment Unit Efficiency"]
[]
[null,"Enter Influent Flow (MGD), Influent Concentration (mg/L) and Effluent Concentration (mg/L) for any parameter"]
[null,"Influent Flow (MGD)","Influent Concentration (mg/L)","Effluent Concentration (mg/L)","Influent Mass Entering Treatment Unit (lbs)","Effluent Mass Leaving Treatment Unit (lbs)","Mass Removed by Treatment Unit (lbs)","Removal Efficiency"]
[null,null,null,null,{"$f":"IF(AND(B6<>\"\",C6<>\"\"),B6*C6*8.34,\"\")","v":""},{"$f":"IF(AND(B6<>\"\",D6<>\"\"),B6*D6*8.34,\"\")","v":""},{"$f":"IF(AND(B6<>\"\",C6<>\"\",D6<>\"\"),(C6-D6)*B6*8.34,\"\")","v":""},{"$f":"IF(AND(B6<>\"\",C6<>\"\",D6<>\"\"),(C6-D6)/C6,\"\")","v":""}]

{"sheet":"F-M Ratio","index":4,"n_rows":6,"n_cols":8,"rows_kept":6,"cut":false,"hidden":false,"merged":[[3,1,3,7]]}
[]
[null,"Food to Microorganism (F:M) Ratio",null,null,null,"Read More -"]
[]
[null,"Enter Influent Flow (MGD), Influent CBOD Concentration (mg/L), Volume of Aeration System (gallons), and MLVSS (mg/L)"]
[null,"Influent Flow (MGD)","Influent CBOD Concentration (mg/L)","Volume of Aeration System (gallons)","Mixed Liquor Volatile Suspended Solids (MLVSS) (mg/L)","Pounds of Food (F) Entering Aeration (lbs)","Pounds of Volatile Solids Under Aeration (lbs)","F:M Ratio"]
[null,null,null,null,null,{"$f":"IF(AND(B6<>\"\",C6<>\"\"),B6*C6*8.34,\"\")","v":""},{"$f":"IF(AND(D6<>\"\",E6<>\"\"),(D6/1000000)*E6*8.34,\"\")","v":""},{"$f":"IF(AND(F6<>\"\",G6<>\"\"),F6/G6,\"\")","v":""}]

{"sheet":"Sludge Generation","index":5,"n_rows":74,"n_cols":43,"rows_kept":74,"cut":false,"hidden":false,"merged":[[69,3,70,5],[69,6,70,14],[69,18,70,20],[69,21,70,29],[71,6,72,14],[71,21,72,29],[73,3,74,5],[73,6,74,14],[73,18,74,20],[73,21,74,29],[0,0,68,0],[0,30,68,30],[5,1,5,29],[6,1,6,4],[6,5,6,15],[6,17,6,19],[6,20,6,27],[8,1,8,5],[8,6,8,13],[8,14,8,19],[8,20,8,27],[8,28,8,29],[9,1,9,29],[6,28,6,29],[7,1,7,5],[7,6,7,13],[7,14,7,19],[7,20,7,27],[7,28,7,29],[11,1,11,29],[12,1,12,10],[12,11,12,21],[12,23,12,27],[12,28,12,29],[13,1,13,29],[10,5,10,7],[10,8,10,9],[10,10,10,16],[10,17,10,24],[10,25,10,27],[10,28,10,29],[17,1,17,29],[18,1,18,17],[18,18,18,21],[18,22,18,24],[18,25,18,29],[19,1,19,29],[14,1,14,10],[14,11,14,21],[14,23,14,27],[14,28,14,29],[15,1,15,29],[16,1,16,11],[16,12,16,15],[16,16,16,29],[24,1,24,29],[25,1,25,11],[25,12,25,14],[25,16,25,18],[25,19,25,20],[25,21,25,29],[20,1,20,17],[20,18,20,21],[20,22,20,24],[20,25,20,29],[21,1,21,29],[22,1,23,17],[22,18,23,21],[22,22,23,29],[30,1,31,15],[30,16,31,18],[30,19,31,29],[32,1,32,29],[33,1,34,15],[33,16,34,18],[33,19,34,21],[33,22,34,29],[26,1,26,29],[27,1,28,15],[27,16,28,18],[27,19,28,21],[27,22,28,29],[29,1,29,29],[39,16,39,18],[39,19,39,21],[39,22,39,23],[39,24,39,26],[39,27,39,29],[40,1,40,29],[35,1,35,29],[36,1,37,15],[36,16,37,18],[36,19,37,21],[36,22,37,29],[38,1,38,29],[45,3,45,5],[45,6,45,14],[45,18,45,20],[45,21,45,29],[46,3,46,5],[46,6,46,14],[46,18,46,20],[46,21,46,29],[41,1,41,29],[42,1,42,29],[43,1,43,14],[43,16,43,29],[44,1,44,14],[44,16,44,29],[49,3,49,5],[49,6,49,14],[49,18,49,20],[49,21,49,29],[50,1,50,14],[50,16,50,29],[47,1,47,14],[47,16,47,29],[48,3,48,5],[48,6,48,14],[48,18,48,20],[48,21,48,29],[53,1,53,14],[53,16,53,29],[54,3,54,5],[54,6,54,14],[54,18,54,20],[54,21,54,29],[51,3,51,5],[51,6,51,14],[51,18,51,20],[51,21,51,29],[52,3,52,5],[52,6,52,14],[52,18,52,20],[52,21,52,29],[57,1,57,14],[57,16,57,29],[58,3,58,5],[58,6,58,14],[58,18,58,20],[58,21,58,29],[55,3,55,5],[55,6,55,14],[55,18,55,20],[55,21,55,29],[56,3,56,5],[56,6,56,14],[56,18,56,20],[56,21,56,29],[67,3,67,5],[67,6,67,14],[67,18,67,20],[67,21,67,29],[1,1,1,29],[3,1,4,29],[59,6,59,14],[59,21,59,29],[65,2,66,2],[65,3,66,5],[65,6,66,14],[65,17,66,17],[65,18,66,20],[65,21,66,29],[62,1,62,14],[62,16,62,29],[63,3,64,5],[63,6,64,14],[63,18,64,20],[63,21,64,29],[61,3,61,5],[61,6,61,14],[61,18,61,20],[61,21,61,29]]}
[null,null,null,null,null,null,null,null,null,null,null,null,null,null,null,null,null,null,null,null,null,null,null,null,null,null,null,null,null,null,null,null,null,null,null,null,null,null,"BOD5","Extended Aeration",0.65,"No Digestion",1]
[null,"Solids Management (Sludge) Calculator",null,null,null,null,null,null,null,null,null,null,null,null,null,null,null,null,null,null,null,null,null,null,null,null,null,null,null,null,null,null,null,null,null,null,null,null,"CBOD5","Conventional Activated Sludge",0.85,"Aerobic Digestion, HDT = 10 Days",0.9]
[null,null,null,null,null,null,null,null,null,null,null,null,null,null,null,null,null,null,null,null," ",null,null,null,null,null,null,null,null,null,null,null,null,null,null,null,null,null,null,"Activated Sludge with Primary Clarification",0.7,"Aerobic Digestion, HDT = 15",0.8]
[null,"This worksheet calculates the expected sludge volume that should be produced by various treatment processes over a one-year period.  Enter data into green cells - hit the Tab key to move between cells.  Red cells are calculated.",null,null,null,null,null,null,null,null,null,null,null,null,null,null,null,null,null,null,null,null,null,null,null,null,null,null,null,null,null,null,null,null,null,null,null,null,null,"Sequencing Batch Reactor",0.65,"Aerobic Digestion, HDT = 20",0.7]
[null,null,null,null,null,null,null,null,null,null,null,null,null,null,null,null,null,null,null,null,null,null,null,null,null,null,null,null,null,null,null,null,null,null,null,null,null,null,null,"Oxidation Ditch",0.65,"Aerobic Digestion, HDT= >30",0.65]
[null,null,null,null,null,null,null,null,null,null,null,null,null,null,null,null,null,null,null,null,null,null,null,null,null,null,null,null,null,null,null,null,null,null,null,null,null,null,null,"Contact Stabilization",1,"Aerobic Thermophilic",0.5]
[null,"Facility Name:",null,null,null,null,null,null,null,null,null,null,null,null,null,null,null,"Permit No.:",null,null,null,null,null,null,null,null,null,null,null,null,null,null,null,null,null,null,null,null,null,"Trickling Filter",1,"Anaerobic Digestion, HDT = 20",0.75]
[null,null,null,null,null,null,"Enter Date",null,null,null,null,null,null,null,null,null,null,null,null,null,"Enter Date",null,null,null,null,null,null,null,null,null,null,null,null,null,null,null,null,null,null,"Rotating Biological Contactor",1,"Anaerobic Digestion, HDT = 30",0.65]
[null,"Evaluation Period:",null,null,null,null,null,null,null,null,null,null,null,null,"to",null,null,null,null,null,null,null,null,null,null,null,null,null,null,null,null,null,null,null,null,null,null,null,null,null,null,"Anaerobic Digestion, HDT = 40",0.55000000000000004]
[]
[null,"Design Flow:",null,null,null,null,null,null,"MGD",null,null,null,null,null,null,null,null,"Actual Annual Average Flow:",null,null,null,null,null,null,null,null,null,null,"MGD"]
[]
[null,"Type of Biological Treatment Process:",null,null,null,null,null,null,null,null,null,null,null,null,null,null,null,null,null,null,null,null,null,"Treatment Factor:",null,null,null,null,{"$f":"IF(L13<>\"\",IF(VLOOKUP(L13,$AN$1:$AO$8,2,FALSE)=\"\",\"\",VLOOKUP(L13,$AN$1:$AO$8,2,FALSE)),\"\")","v":""}]
[]
[null,"Type of Digestion Process:",null,null,null,null,null,null,null,null,null,null,null,null,null,null,null,null,null,null,null,null,null,"Digestion Factor:",null,null,null,null,{"$f":"IF(L15<>\"\",IF(VLOOKUP(L15,$AP$1:$AQ$9,2,FALSE)=\"\",\"\",VLOOKUP(L15,$AP$1:$AQ$9,2,FALSE)),\"\")","v":""}]
{"$rows_left_out":60}
{"sheet":"Alkalinity - Nitrification","index":6,"n_rows":17,"n_cols":11,"rows_kept":17,"cut":false,"hidden":false,"merged":[[15,1,15,5],[16,1,16,5],[10,1,10,3],[11,1,11,5],[3,1,4,5],[6,1,6,3],[12,1,12,3],[13,1,13,3],[14,1,14,3]]}
[null,null,null,null,null,null,null,null,null,null,false]
[null,"Alkalinity Required for Nitrification"]
[]
[null,"Alkalinity is needed for nitrification to meet effluent limits for Ammonia-Nitrogen (NH3-N).  For every pound of NH3-N that must be removed / nitrified, 7.2 lbs of alkalinity is required.  A residual alkalinity of 50 mg/L is assumed for final effluent to meet pH limits but this value can be adjusted."]
[]
[]
[null,"Check box if treatment plant has primary clarifier(s):"]
[null,"Influent Flow (MGD)",{"$f":"IF(K1=TRUE,\"NH3-N Concentration in Primary Clarifier Effuent (mg/L)\",\"Influent NH3-N Concentration (mg/L)\")","v":"Influent NH3-N Concentration (mg/L)"},{"$f":"IF(K1=TRUE,\"Alkalinity Concentration in Primary Clarifier Effuent (mg/L)\",\"Influent Alkalinity Concentration (mg/L)\")","v":"Influent Alkalinity Concentration (mg/L)"},"Average Monthly NH3-N Effluent Limit (mg/L)","Alkalinity Desired in Final Effluent (mg/L)"]
[null,null,null,null,null,50]
[]
[null,{"$f":"IF(AND(B9<>\"\",C9<>\"\",E9<>\"\"),\"NH3-N that must be removed / nitrified:\",\"\")","v":""}]
[null,{"$f":"IF(AND(B9<>\"\",C9<>\"\",E9<>\"\"),CONCATENATE(\"(\",C9,\" mg/L\",\" - \",E9,\" mg/L\",\")\",\" x \",B9,\" MGD\",\" x \",\"8.34 = \",(C9-E9)*B9*8.34,\" lbs/day\"),\"\")","v":""}]
[null,{"$f":"IF(AND(B9<>\"\",C9<>\"\",E9<>\"\"),\"Alkalinity needed for nitification:\",\"\")","v":""}]
[null,{"$f":"IF(AND(B9<>\"\",C9<>\"\",E9<>\"\"),CONCATENATE((C9-E9)*B9*8.34,\" lbs/day\",\" x 7.2 = \",(C9-E9)*B9*8.34*7.2,\" lbs/day\"),\"\")","v":""}]
[null,{"$f":"IF(AND(B9<>\"\",D9<>\"\",F9<>\"\"),\"Alkalinity available for nitrification:\",\"\")","v":""}]
{"$rows_left_out":3}
{"sheet":"Flow Concentration & Loading","index":7,"n_rows":60,"n_cols":35,"rows_kept":60,"cut":false,"hidden":false,"merged":[[3,1,5,23],[48,20,48,22],[59,20,59,22],[8,20,8,22],[24,3,24,4],[8,5,8,11],[8,1,8,4],[15,9,15,10],[23,14,23,15],[48,15,48,17],[48,12,48,14],[48,3,48,5],[48,9,48,11],[37,19,37,21],[37,17,37,18],[37,14,37,16],[29,9,29,10],[37,9,37,11],[8,17,8,19],[8,13,8,16],[9,1,9,3],[59,3,59,5],[59,9,59,11],[59,12,59,14],[59,15,59,17],[37,3,37,5],[37,12,37,13]]}
[]
[null,"Flow, Concentration & Loading",null,null,null,null,null,null,null,null,null,null,null,null,null,null,null,null,null,null," ",null,null,null,null,null,null,"Concentration",0]
[null,null,null,null,null,null,null,null,null,null,null,null,null,null,null,null,null,null,null,null,null,null,null,null,null,null,null,"Flow or Volume",1]
[null,"Below is a Davidson Pie Chart used to illustrate the calculation of flow, concentration and loading.  Click on the drop-down list next to \"Find:\" to select the parameter you wish to calculate.  Click on the drop-down list next to \"Round To:\" to select the number of decimal places you would like to see displayed in the results.  Enter data for the other two parameters into the purple-highlighted cells below the chart.  Note that volume (in million gallons, MG) may be used to determine the pounds (load, lbs) of a parameter such as BOD within a tank, if concentration is known.",null,null,null,null,null,null,null,null,null,null,null,null,null,null,null,null,null,null,null,null,null,null,null,null,null,"Loading or Load",2]
[null,null,null,null,null,null,null,null,null,null,null,null,null,null,null,null,null,null,null,null,null,null,null,null,null,null,null,null,3]
[null,null,null,null,null,null,null,null,null,null,null,null,null,null,null,null,null,null,null,null,null,null,null,null,null,null,null,null,4,null,null,null,null,null," "]
[null,null,null,null,null,null,null,null,null,null,null,null,null,null,null,null,null,null,null,null,null,null,null,null,null,null,null,null,5]
[]
[null,"Find:",null,null,null,null,null,null,null,null,null,null,null,"Round To:",null,null,null,null,null,null,"Decimals"]
[]
[]
[]
[]
[]
[]
{"$rows_left_out":46}
{"sheet":"Geometric Mean","index":8,"n_rows":44,"n_cols":12,"rows_kept":44,"cut":false,"hidden":false,"merged":[[3,1,5,5]]}
[null,null,null,null,null,null,null,null,null,null,1,"<"]
[null,"Fecal Coliform Geometric Mean",null,null,null,null,null,null,null,null,2,">"]
[null,null,null,null,null,null,null,null,null,null,3]
[null,"Select the number of samples collected and analyzed for fecal coliform (or other bacterial parameters) during a month.  Enter the dates the samples were collected, select a qualifier (less than (<) or greater than (>)), if applicable, and enter the result (whole number) in CFU/100 mL or MPN or No./100 mL.  For results of \"0\", enter 1.",null,null,null,null,null,null,null,null,4]
[null,null,null,null,null,null,null,null,null,null,5]
[null,null,null,null,null,null,null,null,null,null,6]
[null,null,null,null,null,null,null,null,null,null,7]
[null,"No. Samples:",null,null,"Geometric Mean:",{"$f":"IF(SUM(E12:E42)<>0,IF(AND(H43=0,H44=0),ROUND(GEOMEAN(E12:E42),0),IF(AND(H43>0,H44=0),CONCATENATE(\"< \",ROUND(GEOMEAN(E12:E42),0)),IF(OR(AND(H43>0,H44>0),AND(H43=0,H44>0)),CONCATENATE(\"> \",ROUND(GEOMEAN(E12:E42),0))))),\"\")","v":""},null,null,null,null,8]
[null,null,null,null,null,null,null,null,null,null,9]
[null,null,null,null,null,null,null,null,null,null,10]
[null,null,"Date","Qualifier","Result",null,null,null,null,null,11]
[null,null,null,null,null,null,null,{"$f":"IF(AND(D12=\"<\",E12<>\"\"),1,IF(AND(D12=\">\",E12<>\"\"),2,\"\"))","v":""},null,null,12]
[null,null,null,null,null,null,null,{"$f":"IF(AND(D13=\"<\",E13<>\"\"),1,IF(AND(D13=\">\",E13<>\"\"),2,\"\"))","v":""},null,null,13]
[null,null,null,null,null,null,null,"",null,null,14]
[null,null,null,null,null,null,null,"",null,null,15]
{"$rows_left_out":29}